{"text_format":"1","workbook":"xlsx","n_sheets":3,"sheets":["URLs","Palavras-chave","Infos"],"not_rendered":{"charts":0,"images":3,"macros":1,"external_links":0,"defined_names":0,"comments":0,"pivot_tables":0},"unopened":[],"bounds":{"document_bytes":16777216,"sheet_cells":100000,"rows_first":2000,"rows_last":500,"rows_between":2000,"halvings":0,"cell_chars":16384,"cell_head_chars":4096},"cells_cut":0,"cells_raw":0,"read":"whole","date_system":"1900"}

{"sheet":"URLs","index":0,"n_rows":104,"n_cols":12,"rows_kept":104,"cut":false,"hidden":false,"merged":[[0,0,0,4],[0,7,0,8],[1,0,1,11]]}
[]
["SEO - Títulos otimizados"]
["Tipo da página","#","Código Prod","URL","Título <title>","Título <title>","Tamanho","Descrição - description","Tamanho","Palavra-chave\nPreencha aqui!","Título H1","Alt Imagem Principal"]
["i.e. website page, blog post, landing page etc.",0,null,null,null,null,"Média de 60 caracteres",null,"Máximo de 160 caracteres"]
["Home",1,null,"https://www.site.com.br/","F Eletrônicos - Computadores, MacBook, iPhone",null,{"$f":"LEN(CONCATENATE(E5,F5))","v":45},null,{"$f":"LEN(H5)","v":0}]
["Categoria",2,null,"https://www.site.com.br/apple","Apple - MacBook, iPhone, iPad"," | F Eletrônicos",45,null,0,"Apple"]
["SubCategoria",3,null,"https://www.site.com.br/apple/iphone","Apple iPhone em oferta - iPhone Xs e iPhone 8 em Promoção"," | F Eletrônicos",73,"Todos os modelos de iPhone em promoção na F Eletrônicos. ",57,"iPhone"]
["Produto",4,1234,"https://www.site.com.br/iphone-xs","iPhone Xs em Oferta"," | F Eletrônicos",35,"Compre o iPhone Xs em 10x sem juros e Frete Grátis na F Eletrônicos. Confira!",77,"iPhone xs","iPhone Xs Apple 128Gb Branco","iPhone Xs Branco"]
["YouTube",5,null,"https://www.youtube.com/","Como usar os novos recursos do iPhone Xs"," - YouTube",50,null,0,"iPhone xs","Como usar os novos recursos do iPhone Xs"]
["Mercado Livre",6,null,"https://produto.mercadolivre.com.br/MLB-1101645772-obaphone-barra-celular-para-idosos-obabox-_JM","Obaphone Barra - Celular Para Idosos Obabox - R$ 229,80"," em Mercado Livre",72,"Compre-o no Mercado Livre por R$ 229,80 - Compre em 12 parcelas - Frete grátis. Encontre mais produtos de Eletrônicos, Áudio e Vídeo, Outros Eletrônicos.",153,"ObaPhone","Obaphone Barra - Celular Para Idosos Obabox"]
[null,7,null,null,null,null,0,null,0]
[null,8,null,null,null,null,0,null,0]
[null,9,null,null,null,null,0,null,0]
[null,10,null,null,null,null,0,null,0]
[null,11,null,null,null,null,0,null,0]
[null,12,null,null,null,null,0,null,0]
[null,13,null,null,null,null,0,null,0]
[null,14,null,null,null,null,0,null,0]
[null,15,null,null,null,null,0,null,0]
[null,16,null,null,null,null,0,null,0]
[null,17,null,null,null,null,0,null,0]
[null,18,null,null,null,null,0,null,0]
[null,19,null,null,null,null,0,null,0]
[null,20,null,null,null,null,0,null,0]
[null,21,null,null,null,null,0,null,0]
[null,22,null,null,null,null,0,null,0]
[null,23,null,null,null,null,0,null,0]
[null,24,null,null,null,null,0,null,0]
[null,25,null,null,null,null,0,null,0]
[null,26,null,null,null,null,0,null,0]
[null,27,null,null,null,null,0,null,0]
[null,28,null,null,null,null,0,null,0]
[null,29,null,null,null,null,0,null,0]
[null,30,null,null,null,null,0,null,0]
[null,31,null,null,null,null,0,null,0]
[null,32,null,null,null,null,0,null,0]
[null,33,null,null,null,null,0,null,0]
[null,34,null,null,null,null,0,null,0]
[null,35,null,null,null,null,0,null,0]
[null,36,null,null,null,null,0,null,0]
[null,37,null,null,null,null,0,null,{"$f":"LEN(H41)","v":0}]
[null,38,null,null,null,null,0,null,0]
[null,39,null,null,null,null,0,null,0]
[null,40,null,null,null,null,0,null,0]
[null,41,null,null,null,null,0,null,0]
[null,42,null,null,null,null,0,null,0]
[null,43,null,null,null,null,0,null,0]
[null,44,null,null,null,null,0,null,0]
[null,45,null,null,null,null,0,null,0]
[null,46,null,null,null,null,0,null,0]
[null,47,null,null,null,null,{"$f":"LEN(CONCATENATE(E51,F51))","v":0},null,0]
[null,48,null,null,null,null,{"$f":"LEN(CONCATENATE(E52,F52))","v":0},null,0]
[null,49,null,null,null,null,0,null,0]
[null,50,null,null,null,null,0,null,0]
[null,51,null,null,null,null,0,null,0]
[null,52,null,null,null,null,0,null,0]
[null,53,null,null,null,null,0,null,0]
[null,54,null,null,null,null,0,null,0]
[null,55,null,null,null,null,0,null,0]
[null,56,null,null,null,null,0,null,0]
[null,57,null,null,null,null,0,null,0]
[null,58,null,null,null,null,0,null,0]
[null,59,null,null,null,null,0,null,0]
[null,60,null,null,null,null,0,null,0]
[null,61,null,null,null,null,0,null,0]
[null,62,null,null,null,null,0,null,0]
[null,63,null,null,null,null,0,null,0]
[null,64,null,null,null,null,0,null,0]
[null,65,null,null,null,null,0,null,0]
[null,66,null,null,null,null,0,null,0]
[null,67,null,null,null,null,0,null,0]
[null,68,null,null,null,null,0,null,0]
[null,69,null,null,null,null,0,null,0]
[null,70,null,null,null,null,0,null,0]
[null,71,null,null,null,null,0,null,0]
[null,72,null,null,null,null,0,null,0]
[null,73,null,null,null,null,0,null,0]
[null,74,null,null,null,null,0,null,0]
[null,75,null,null,null,null,0,null,0]
[null,76,null,null,null,null,0,null,0]
[null,77,null,null,null,null,0,null,0]
[null,78,null,null,null,null,0,null,0]
[null,79,null,null,null,null,0,null,0]
[null,80,null,null,null,null,0,null,0]
[null,81,null,null,null,null,0,null,0]
[null,82,null,null,null,null,0,null,0]
[null,83,null,null,null,null,0,null,0]
[null,84,null,null,null,null,0,null,0]
[null,85,null,null,null,null,0,null,0]
[null,86,null,null,null,null,0,null,0]
[null,87,null,null,null,null,0,null,0]
[null,88,null,null,null,null,0,null,0]
[null,89,null,null,null,null,0,null,0]
[null,90,null,null,null,null,0,null,0]
[null,91,null,null,null,null,0,null,0]
[null,92,null,null,null,null,0,null,0]
[null,93,null,null,null,null,0,null,0]
[null,94,null,null,null,null,0,null,0]
[null,95,null,null,null,null,0,null,0]
[null,96,null,null,null,null,0,null,0]
[null,97,null,null,null,null,0,null,0]
[null,98,null,null,null,null,0,null,0]
[null,99,null,null,null,null,0,null,0]
[null,100,null,null,null,null,0,null,0]

{"sheet":"Palavras-chave","index":1,"n_rows":104,"n_cols":9,"rows_kept":104,"cut":false,"hidden":false,"merged":[[2,1,3,1],[0,0,0,2],[0,3,0,5],[2,2,2,5],[1,0,1,8]]}
[]
["SEO - Análise de palavras-chave"]
["#","URL","SEO"]
[0,null,"Palavra-chave\nNão alterar","Otimizado","Título <title>","URL","H1","alt image","Description"]
[1,{"$f":"IFERROR(IF(VLOOKUP($A5,URLs!B$5:J$104,3,)<>0,VLOOKUP($A5,URLs!B$5:J$104,3,),\"\"),\"\")","v":"https://www.site.com.br/"},{"$f":"IFERROR(IF(VLOOKUP($A5,URLs!B$5:J$104,9,)<>0,VLOOKUP($A5,URLs!B$5:J$104,9,),\"\"),\"\")","v":""},{"$f":"IF(C5=\"\",0%,COUNTIF(E5:I5,\"ok\")/COUNTA(E$4:I$4))","v":0},{"$f":"IF(C5<>\"\",IFERROR(IF(SEARCH($C5,URLs!E5,1),\"ok\"),\"Palavra-chave não encontrada no título\"),\"--\")","v":"--"},{"$f":"IF(C5<>\"\",IFERROR(IF(SEARCH(SUBSTITUTE(tiraAcento($C5),\" \",\"-\"),URLs!D5,1),\"ok\"),\"Palavra-chave não encontrada na URL\"),\"--\")","v":"--"},{"$f":"IF(C5<>\"\",IFERROR(IF(SEARCH($C5,URLs!K5,1),\"ok\"),\"Palavra-chave não encontrada no Título H1\"),\"--\")","v":"--"},{"$f":"IF(C5<>\"\",IFERROR(IF(SEARCH($C5,URLs!L5,1),\"ok\"),\"Palavra-chave não encontrada na imagem\"),\"--\")","v":"--"},{"$f":"IF(C5<>\"\",IF(URLs!H5=\"\",\"Descrição não preeenchida\",\"ok\"),\"--\")","v":"--"}]
[2,{"$f":"IFERROR(IF(VLOOKUP($A6,URLs!B$5:J$104,3,)<>0,VLOOKUP($A6,URLs!B$5:J$104,3,),\"\"),\"\")","v":"https://www.site.com.br/apple"},{"$f":"IFERROR(IF(VLOOKUP($A6,URLs!B$5:J$104,9,)<>0,VLOOKUP($A6,URLs!B$5:J$104,9,),\"\"),\"\")","v":"Apple"},{"$f":"IF(C6=\"\",0%,COUNTIF(E6:I6,\"ok\")/COUNTA(E$4:I$4))","v":0.4},{"$f":"IF(C6<>\"\",IFERROR(IF(SEARCH($C6,URLs!E6,1),\"ok\"),\"Palavra-chave não encontrada no título\"),\"--\")","v":"ok"},{"$f":"IF(C6<>\"\",IFERROR(IF(SEARCH(SUBSTITUTE(tiraAcento($C6),\" \",\"-\"),URLs!D6,1),\"ok\"),\"Palavra-chave não encontrada na URL\"),\"--\")","v":"ok"},{"$f":"IF(C6<>\"\",IFERROR(IF(SEARCH($C6,URLs!K6,1),\"ok\"),\"Palavra-chave não encontrada no Título H1\"),\"--\")","v":"Palavra-chave não encontrada no Título H1"},{"$f":"IF(C6<>\"\",IFERROR(IF(SEARCH($C6,URLs!L6,1),\"ok\"),\"Palavra-chave não encontrada na imagem\"),\"--\")","v":"Palavra-chave não encontrada na imagem"},{"$f":"IF(C6<>\"\",IF(URLs!H6=\"\",\"Descrição não preeenchida\",\"ok\"),\"--\")","v":"Descrição não preeenchida"}]
[3,{"$f":"IFERROR(IF(VLOOKUP($A7,URLs!B$5:J$104,3,)<>0,VLOOKUP($A7,URLs!B$5:J$104,3,),\"\"),\"\")","v":"https://www.site.com.br/apple/iphone"},{"$f":"IFERROR(IF(VLOOKUP($A7,URLs!B$5:J$104,9,)<>0,VLOOKUP($A7,URLs!B$5:J$104,9,),\"\"),\"\")","v":"iPhone"},0.6,{"$f":"IF(C7<>\"\",IFERROR(IF(SEARCH($C7,URLs!E7,1),\"ok\"),\"Palavra-chave não encontrada no título\"),\"--\")","v":"ok"},{"$f":"IF(C7<>\"\",IFERROR(IF(SEARCH(SUBSTITUTE(tiraAcento($C7),\" \",\"-\"),URLs!D7,1),\"ok\"),\"Palavra-chave não encontrada na URL\"),\"--\")","v":"ok"},{"$f":"IF(C7<>\"\",IFERROR(IF(SEARCH($C7,URLs!K7,1),\"ok\"),\"Palavra-chave não encontrada no Título H1\"),\"--\")","v":"Palavra-chave não encontrada no Título H1"},{"$f":"IF(C7<>\"\",IFERROR(IF(SEARCH($C7,URLs!L7,1),\"ok\"),\"Palavra-chave não encontrada na imagem\"),\"--\")","v":"Palavra-chave não encontrada na imagem"},{"$f":"IF(C7<>\"\",IF(URLs!H7=\"\",\"Descrição não preeenchida\",\"ok\"),\"--\")","v":"ok"}]
[4,{"$f":"IFERROR(IF(VLOOKUP($A8,URLs!B$5:J$104,3,)<>0,VLOOKUP($A8,URLs!B$5:J$104,3,),\"\"),\"\")","v":"https://www.site.com.br/iphone-xs"},{"$f":"IFERROR(IF(VLOOKUP($A8,URLs!B$5:J$104,9,)<>0,VLOOKUP($A8,URLs!B$5:J$104,9,),\"\"),\"\")","v":"iPhone xs"},1,{"$f":"IF(C8<>\"\",IFERROR(IF(SEARCH($C8,URLs!E8,1),\"ok\"),\"Palavra-chave não encontrada no título\"),\"--\")","v":"ok"},{"$f":"IF(C8<>\"\",IFERROR(IF(SEARCH(SUBSTITUTE(tiraAcento($C8),\" \",\"-\"),URLs!D8,1),\"ok\"),\"Palavra-chave não encontrada na URL\"),\"--\")","v":"ok"},{"$f":"IF(C8<>\"\",IFERROR(IF(SEARCH($C8,URLs!K8,1),\"ok\"),\"Palavra-chave não encontrada no Título H1\"),\"--\")","v":"ok"},{"$f":"IF(C8<>\"\",IFERROR(IF(SEARCH($C8,URLs!L8,1),\"ok\"),\"Palavra-chave não encontrada na imagem\"),\"--\")","v":"ok"},{"$f":"IF(C8<>\"\",IF(URLs!H8=\"\",\"Descrição não preeenchida\",\"ok\"),\"--\")","v":"ok"}]
[5,{"$f":"IFERROR(IF(VLOOKUP($A9,URLs!B$5:J$104,3,)<>0,VLOOKUP($A9,URLs!B$5:J$104,3,),\"\"),\"\")","v":"https://www.youtube.com/"},{"$f":"IFERROR(IF(VLOOKUP($A9,URLs!B$5:J$104,9,)<>0,VLOOKUP($A9,URLs!B$5:J$104,9,),\"\"),\"\")","v":"iPhone xs"},0.4,{"$f":"IF(C9<>\"\",IFERROR(IF(SEARCH($C9,URLs!E9,1),\"ok\"),\"Palavra-chave não encontrada no título\"),\"--\")","v":"ok"},{"$f":"IF(C9<>\"\",IFERROR(IF(SEARCH(SUBSTITUTE(tiraAcento($C9),\" \",\"-\"),URLs!D9,1),\"ok\"),\"Palavra-chave não encontrada na URL\"),\"--\")","v":"Palavra-chave não encontrada na URL"},{"$f":"IF(C9<>\"\",IFERROR(IF(SEARCH($C9,URLs!K9,1),\"ok\"),\"Palavra-chave não encontrada no Título H1\"),\"--\")","v":"ok"},{"$f":"IF(C9<>\"\",IFERROR(IF(SEARCH($C9,URLs!L9,1),\"ok\"),\"Palavra-chave não encontrada na imagem\"),\"--\")","v":"Palavra-chave não encontrada na imagem"},{"$f":"IF(C9<>\"\",IF(URLs!H9=\"\",\"Descrição não preeenchida\",\"ok\"),\"--\")","v":"Descrição não preeenchida"}]
[6,{"$f":"IFERROR(IF(VLOOKUP($A10,URLs!B$5:J$104,3,)<>0,VLOOKUP($A10,URLs!B$5:J$104,3,),\"\"),\"\")","v":"https://produto.mercadolivre.com.br/MLB-1101645772-obaphone-barra-celular-para-idosos-obabox-_JM"},{"$f":"IFERROR(IF(VLOOKUP($A10,URLs!B$5:J$104,9,)<>0,VLOOKUP($A10,URLs!B$5:J$104,9,),\"\"),\"\")","v":"ObaPhone"},0.8,{"$f":"IF(C10<>\"\",IFERROR(IF(SEARCH($C10,URLs!E10,1),\"ok\"),\"Palavra-chave não encontrada no título\"),\"--\")","v":"ok"},{"$f":"IF(C10<>\"\",IFERROR(IF(SEARCH(SUBSTITUTE(tiraAcento($C10),\" \",\"-\"),URLs!D10,1),\"ok\"),\"Palavra-chave não encontrada na URL\"),\"--\")","v":"ok"},{"$f":"IF(C10<>\"\",IFERROR(IF(SEARCH($C10,URLs!K10,1),\"ok\"),\"Palavra-chave não encontrada no Título H1\"),\"--\")","v":"ok"},{"$f":"IF(C10<>\"\",IFERROR(IF(SEARCH($C10,URLs!L10,1),\"ok\"),\"Palavra-chave não encontrada na imagem\"),\"--\")","v":"Palavra-chave não encontrada na imagem"},{"$f":"IF(C10<>\"\",IF(URLs!H10=\"\",\"Descrição não preeenchida\",\"ok\"),\"--\")","v":"ok"}]
[7,{"$f":"IFERROR(IF(VLOOKUP($A11,URLs!B$5:J$104,3,)<>0,VLOOKUP($A11,URLs!B$5:J$104,3,),\"\"),\"\")","v":""},{"$f":"IFERROR(IF(VLOOKUP($A11,URLs!B$5:J$104,9,)<>0,VLOOKUP($A11,URLs!B$5:J$104,9,),\"\"),\"\")","v":""},0,{"$f":"IF(C11<>\"\",IFERROR(IF(SEARCH($C11,URLs!E11,1),\"ok\"),\"Palavra-chave não encontrada no título\"),\"--\")","v":"--"},{"$f":"IF(C11<>\"\",IFERROR(IF(SEARCH(SUBSTITUTE(tiraAcento($C11),\" \",\"-\"),URLs!D11,1),\"ok\"),\"Palavra-chave não encontrada na URL\"),\"--\")","v":"--"},{"$f":"IF(C11<>\"\",IFERROR(IF(SEARCH($C11,URLs!K11,1),\"ok\"),\"Palavra-chave não encontrada no Título H1\"),\"--\")","v":"--"},{"$f":"IF(C11<>\"\",IFERROR(IF(SEARCH($C11,URLs!L11,1),\"ok\"),\"Palavra-chave não encontrada na imagem\"),\"--\")","v":"--"},{"$f":"IF(C11<>\"\",IF(URLs!H11=\"\",\"Descrição não preeenchida\",\"ok\"),\"--\")","v":"--"}]
[8,{"$f":"IFERROR(IF(VLOOKUP($A12,URLs!B$5:J$104,3,)<>0,VLOOKUP($A12,URLs!B$5:J$104,3,),\"\"),\"\")","v":""},{"$f":"IFERROR(IF(VLOOKUP($A12,URLs!B$5:J$104,9,)<>0,VLOOKUP($A12,URLs!B$5:J$104,9,),\"\"),\"\")","v":""},0,{"$f":"IF(C12<>\"\",IFERROR(IF(SEARCH($C12,URLs!E12,1),\"ok\"),\"Palavra-chave não encontrada no título\"),\"--\")","v":"--"},{"$f":"IF(C12<>\"\",IFERROR(IF(SEARCH(SUBSTITUTE(tiraAcento($C12),\" \",\"-\"),URLs!D12,1),\"ok\"),\"Palavra-chave não encontrada na URL\"),\"--\")","v":"--"},{"$f":"IF(C12<>\"\",IFERROR(IF(SEARCH($C12,URLs!K12,1),\"ok\"),\"Palavra-chave não encontrada no Título H1\"),\"--\")","v":"--"},{"$f":"IF(C12<>\"\",IFERROR(IF(SEARCH($C12,URLs!L12,1),\"ok\"),\"Palavra-chave não encontrada na imagem\"),\"--\")","v":"--"},{"$f":"IF(C12<>\"\",IF(URLs!H12=\"\",\"Descrição não preeenchida\",\"ok\"),\"--\")","v":"--"}]
[9,{"$f":"IFERROR(IF(VLOOKUP($A13,URLs!B$5:J$104,3,)<>0,VLOOKUP($A13,URLs!B$5:J$104,3,),\"\"),\"\")","v":""},{"$f":"IFERROR(IF(VLOOKUP($A13,URLs!B$5:J$104,9,)<>0,VLOOKUP($A13,URLs!B$5:J$104,9,),\"\"),\"\")","v":""},0,{"$f":"IF(C13<>\"\",IFERROR(IF(SEARCH($C13,URLs!E13,1),\"ok\"),\"Palavra-chave não encontrada no título\"),\"--\")","v":"--"},{"$f":"IF(C13<>\"\",IFERROR(IF(SEARCH(SUBSTITUTE(tiraAcento($C13),\" \",\"-\"),URLs!D13,1),\"ok\"),\"Palavra-chave não encontrada na URL\"),\"--\")","v":"--"},{"$f":"IF(C13<>\"\",IFERROR(IF(SEARCH($C13,URLs!K13,1),\"ok\"),\"Palavra-chave não encontrada no Título H1\"),\"--\")","v":"--"},{"$f":"IF(C13<>\"\",IFERROR(IF(SEARCH($C13,URLs!L13,1),\"ok\"),\"Palavra-chave não encontrada na imagem\"),\"--\")","v":"--"},{"$f":"IF(C13<>\"\",IF(URLs!H13=\"\",\"Descrição não preeenchida\",\"ok\"),\"--\")","v":"--"}]
[10,{"$f":"IFERROR(IF(VLOOKUP($A14,URLs!B$5:J$104,3,)<>0,VLOOKUP($A14,URLs!B$5:J$104,3,),\"\"),\"\")","v":""},{"$f":"IFERROR(IF(VLOOKUP($A14,URLs!B$5:J$104,9,)<>0,VLOOKUP($A14,URLs!B$5:J$104,9,),\"\"),\"\")","v":""},0,{"$f":"IF(C14<>\"\",IFERROR(IF(SEARCH($C14,URLs!E14,1),\"ok\"),\"Palavra-chave não encontrada no título\"),\"--\")","v":"--"},{"$f":"IF(C14<>\"\",IFERROR(IF(SEARCH(SUBSTITUTE(tiraAcento($C14),\" \",\"-\"),URLs!D14,1),\"ok\"),\"Palavra-chave não encontrada na URL\"),\"--\")","v":"--"},{"$f":"IF(C14<>\"\",IFERROR(IF(SEARCH($C14,URLs!K14,1),\"ok\"),\"Palavra-chave não encontrada no Título H1\"),\"--\")","v":"--"},{"$f":"IF(C14<>\"\",IFERROR(IF(SEARCH($C14,URLs!L14,1),\"ok\"),\"Palavra-chave não encontrada na imagem\"),\"--\")","v":"--"},{"$f":"IF(C14<>\"\",IF(URLs!H14=\"\",\"Descrição não preeenchida\",\"ok\"),\"--\")","v":"--"}]
[11,{"$f":"IFERROR(IF(VLOOKUP($A15,URLs!B$5:J$104,3,)<>0,VLOOKUP($A15,URLs!B$5:J$104,3,),\"\"),\"\")","v":""},{"$f":"IFERROR(IF(VLOOKUP($A15,URLs!B$5:J$104,9,)<>0,VLOOKUP($A15,URLs!B$5:J$104,9,),\"\"),\"\")","v":""},0,{"$f":"IF(C15<>\"\",IFERROR(IF(SEARCH($C15,URLs!E15,1),\"ok\"),\"Palavra-chave não encontrada no título\"),\"--\")","v":"--"},{"$f":"IF(C15<>\"\",IFERROR(IF(SEARCH(SUBSTITUTE(tiraAcento($C15),\" \",\"-\"),URLs!D15,1),\"ok\"),\"Palavra-chave não encontrada na URL\"),\"--\")","v":"--"},{"$f":"IF(C15<>\"\",IFERROR(IF(SEARCH($C15,URLs!K15,1),\"ok\"),\"Palavra-chave não encontrada no Título H1\"),\"--\")","v":"--"},{"$f":"IF(C15<>\"\",IFERROR(IF(SEARCH($C15,URLs!L15,1),\"ok\"),\"Palavra-chave não encontrada na imagem\"),\"--\")","v":"--"},{"$f":"IF(C15<>\"\",IF(URLs!H15=\"\",\"Descrição não preeenchida\",\"ok\"),\"--\")","v":"--"}]
[12,{"$f":"IFERROR(IF(VLOOKUP($A16,URLs!B$5:J$104,3,)<>0,VLOOKUP($A16,URLs!B$5:J$104,3,),\"\"),\"\")","v":""},{"$f":"IFERROR(IF(VLOOKUP($A16,URLs!B$5:J$104,9,)<>0,VLOOKUP($A16,URLs!B$5:J$104,9,),\"\"),\"\")","v":""},0,{"$f":"IF(C16<>\"\",IFERROR(IF(SEARCH($C16,URLs!E16,1),\"ok\"),\"Palavra-chave não encontrada no título\"),\"--\")","v":"--"},{"$f":"IF(C16<>\"\",IFERROR(IF(SEARCH(SUBSTITUTE(tiraAcento($C16),\" \",\"-\"),URLs!D16,1),\"ok\"),\"Palavra-chave não encontrada na URL\"),\"--\")","v":"--"},{"$f":"IF(C16<>\"\",IFERROR(IF(SEARCH($C16,URLs!K16,1),\"ok\"),\"Palavra-chave não encontrada no Título H1\"),\"--\")","v":"--"},{"$f":"IF(C16<>\"\",IFERROR(IF(SEARCH($C16,URLs!L16,1),\"ok\"),\"Palavra-chave não encontrada na imagem\"),\"--\")","v":"--"},{"$f":"IF(C16<>\"\",IF(URLs!H16=\"\",\"Descrição não preeenchida\",\"ok\"),\"--\")","v":"--"}]
[13,{"$f":"IFERROR(IF(VLOOKUP($A17,URLs!B$5:J$104,3,)<>0,VLOOKUP($A17,URLs!B$5:J$104,3,),\"\"),\"\")","v":""},{"$f":"IFERROR(IF(VLOOKUP($A17,URLs!B$5:J$104,9,)<>0,VLOOKUP($A17,URLs!B$5:J$104,9,),\"\"),\"\")","v":""},0,{"$f":"IF(C17<>\"\",IFERROR(IF(SEARCH($C17,URLs!E17,1),\"ok\"),\"Palavra-chave não encontrada no título\"),\"--\")","v":"--"},{"$f":"IF(C17<>\"\",IFERROR(IF(SEARCH(SUBSTITUTE(tiraAcento($C17),\" \",\"-\"),URLs!D17,1),\"ok\"),\"Palavra-chave não encontrada na URL\"),\"--\")","v":"--"},{"$f":"IF(C17<>\"\",IFERROR(IF(SEARCH($C17,URLs!K17,1),\"ok\"),\"Palavra-chave não encontrada no Título H1\"),\"--\")","v":"--"},{"$f":"IF(C17<>\"\",IFERROR(IF(SEARCH($C17,URLs!L17,1),\"ok\"),\"Palavra-chave não encontrada na imagem\"),\"--\")","v":"--"},{"$f":"IF(C17<>\"\",IF(URLs!H17=\"\",\"Descrição não preeenchida\",\"ok\"),\"--\")","v":"--"}]
[14,{"$f":"IFERROR(IF(VLOOKUP($A18,URLs!B$5:J$104,3,)<>0,VLOOKUP($A18,URLs!B$5:J$104,3,),\"\"),\"\")","v":""},{"$f":"IFERROR(IF(VLOOKUP($A18,URLs!B$5:J$104,9,)<>0,VLOOKUP($A18,URLs!B$5:J$104,9,),\"\"),\"\")","v":""},0,{"$f":"IF(C18<>\"\",IFERROR(IF(SEARCH($C18,URLs!E18,1),\"ok\"),\"Palavra-chave não encontrada no título\"),\"--\")","v":"--"},{"$f":"IF(C18<>\"\",IFERROR(IF(SEARCH(SUBSTITUTE(tiraAcento($C18),\" \",\"-\"),URLs!D18,1),\"ok\"),\"Palavra-chave não encontrada na URL\"),\"--\")","v":"--"},{"$f":"IF(C18<>\"\",IFERROR(IF(SEARCH($C18,URLs!K18,1),\"ok\"),\"Palavra-chave não encontrada no Título H1\"),\"--\")","v":"--"},{"$f":"IF(C18<>\"\",IFERROR(IF(SEARCH($C18,URLs!L18,1),\"ok\"),\"Palavra-chave não encontrada na imagem\"),\"--\")","v":"--"},{"$f":"IF(C18<>\"\",IF(URLs!H18=\"\",\"Descrição não preeenchida\",\"ok\"),\"--\")","v":"--"}]
[15,{"$f":"IFERROR(IF(VLOOKUP($A19,URLs!B$5:J$104,3,)<>0,VLOOKUP($A19,URLs!B$5:J$104,3,),\"\"),\"\")","v":""},{"$f":"IFERROR(IF(VLOOKUP($A19,URLs!B$5:J$104,9,)<>0,VLOOKUP($A19,URLs!B$5:J$104,9,),\"\"),\"\")","v":""},0,{"$f":"IF(C19<>\"\",IFERROR(IF(SEARCH($C19,URLs!E19,1),\"ok\"),\"Palavra-chave não encontrada no título\"),\"--\")","v":"--"},{"$f":"IF(C19<>\"\",IFERROR(IF(SEARCH(SUBSTITUTE(tiraAcento($C19),\" \",\"-\"),URLs!D19,1),\"ok\"),\"Palavra-chave não encontrada na URL\"),\"--\")","v":"--"},{"$f":"IF(C19<>\"\",IFERROR(IF(SEARCH($C19,URLs!K19,1),\"ok\"),\"Palavra-chave não encontrada no Título H1\"),\"--\")","v":"--"},{"$f":"IF(C19<>\"\",IFERROR(IF(SEARCH($C19,URLs!L19,1),\"ok\"),\"Palavra-chave não encontrada na imagem\"),\"--\")","v":"--"},{"$f":"IF(C19<>\"\",IF(URLs!H19=\"\",\"Descrição não preeenchida\",\"ok\"),\"--\")","v":"--"}]
[16,{"$f":"IFERROR(IF(VLOOKUP($A20,URLs!B$5:J$104,3,)<>0,VLOOKUP($A20,URLs!B$5:J$104,3,),\"\"),\"\")","v":""},{"$f":"IFERROR(IF(VLOOKUP($A20,URLs!B$5:J$104,9,)<>0,VLOOKUP($A20,URLs!B$5:J$104,9,),\"\"),\"\")","v":""},0,{"$f":"IF(C20<>\"\",IFERROR(IF(SEARCH($C20,URLs!E20,1),\"ok\"),\"Palavra-chave não encontrada no título\"),\"--\")","v":"--"},{"$f":"IF(C20<>\"\",IFERROR(IF(SEARCH(SUBSTITUTE(tiraAcento($C20),\" \",\"-\"),URLs!D20,1),\"ok\"),\"Palavra-chave não encontrada na URL\"),\"--\")","v":"--"},{"$f":"IF(C20<>\"\",IFERROR(IF(SEARCH($C20,URLs!K20,1),\"ok\"),\"Palavra-chave não encontrada no Título H1\"),\"--\")","v":"--"},{"$f":"IF(C20<>\"\",IFERROR(IF(SEARCH($C20,URLs!L20,1),\"ok\"),\"Palavra-chave não encontrada na imagem\"),\"--\")","v":"--"},{"$f":"IF(C20<>\"\",IF(URLs!H20=\"\",\"Descrição não preeenchida\",\"ok\"),\"--\")","v":"--"}]
[17,{"$f":"IFERROR(IF(VLOOKUP($A21,URLs!B$5:J$104,3,)<>0,VLOOKUP($A21,URLs!B$5:J$104,3,),\"\"),\"\")","v":""},{"$f":"IFERROR(IF(VLOOKUP($A21,URLs!B$5:J$104,9,)<>0,VLOOKUP($A21,URLs!B$5:J$104,9,),\"\"),\"\")","v":""},0,{"$f":"IF(C21<>\"\",IFERROR(IF(SEARCH($C21,URLs!E21,1),\"ok\"),\"Palavra-chave não encontrada no título\"),\"--\")","v":"--"},{"$f":"IF(C21<>\"\",IFERROR(IF(SEARCH(SUBSTITUTE(tiraAcento($C21),\" \",\"-\"),URLs!D21,1),\"ok\"),\"Palavra-chave não encontrada na URL\"),\"--\")","v":"--"},{"$f":"IF(C21<>\"\",IFERROR(IF(SEARCH($C21,URLs!K21,1),\"ok\"),\"Palavra-chave não encontrada no Título H1\"),\"--\")","v":"--"},{"$f":"IF(C21<>\"\",IFERROR(IF(SEARCH($C21,URLs!L21,1),\"ok\"),\"Palavra-chave não encontrada na imagem\"),\"--\")","v":"--"},{"$f":"IF(C21<>\"\",IF(URLs!H21=\"\",\"Descrição não preeenchida\",\"ok\"),\"--\")","v":"--"}]
[18,{"$f":"IFERROR(IF(VLOOKUP($A22,URLs!B$5:J$104,3,)<>0,VLOOKUP($A22,URLs!B$5:J$104,3,),\"\"),\"\")","v":""},{"$f":"IFERROR(IF(VLOOKUP($A22,URLs!B$5:J$104,9,)<>0,VLOOKUP($A22,URLs!B$5:J$104,9,),\"\"),\"\")","v":""},0,{"$f":"IF(C22<>\"\",IFERROR(IF(SEARCH($C22,URLs!E22,1),\"ok\"),\"Palavra-chave não encontrada no título\"),\"--\")","v":"--"},{"$f":"IF(C22<>\"\",IFERROR(IF(SEARCH(SUBSTITUTE(tiraAcento($C22),\" \",\"-\"),URLs!D22,1),\"ok\"),\"Palavra-chave não encontrada na URL\"),\"--\")","v":"--"},{"$f":"IF(C22<>\"\",IFERROR(IF(SEARCH($C22,URLs!K22,1),\"ok\"),\"Palavra-chave não encontrada no Título H1\"),\"--\")","v":"--"},{"$f":"IF(C22<>\"\",IFERROR(IF(SEARCH($C22,URLs!L22,1),\"ok\"),\"Palavra-chave não encontrada na imagem\"),\"--\")","v":"--"},{"$f":"IF(C22<>\"\",IF(URLs!H22=\"\",\"Descrição não preeenchida\",\"ok\"),\"--\")","v":"--"}]
[19,{"$f":"IFERROR(IF(VLOOKUP($A23,URLs!B$5:J$104,3,)<>0,VLOOKUP($A23,URLs!B$5:J$104,3,),\"\"),\"\")","v":""},{"$f":"IFERROR(IF(VLOOKUP($A23,URLs!B$5:J$104,9,)<>0,VLOOKUP($A23,URLs!B$5:J$104,9,),\"\"),\"\")","v":""},0,{"$f":"IF(C23<>\"\",IFERROR(IF(SEARCH($C23,URLs!E23,1),\"ok\"),\"Palavra-chave não encontrada no título\"),\"--\")","v":"--"},{"$f":"IF(C23<>\"\",IFERROR(IF(SEARCH(SUBSTITUTE(tiraAcento($C23),\" \",\"-\"),URLs!D23,1),\"ok\"),\"Palavra-chave não encontrada na URL\"),\"--\")","v":"--"},{"$f":"IF(C23<>\"\",IFERROR(IF(SEARCH($C23,URLs!K23,1),\"ok\"),\"Palavra-chave não encontrada no Título H1\"),\"--\")","v":"--"},{"$f":"IF(C23<>\"\",IFERROR(IF(SEARCH($C23,URLs!L23,1),\"ok\"),\"Palavra-chave não encontrada na imagem\"),\"--\")","v":"--"},{"$f":"IF(C23<>\"\",IF(URLs!H23=\"\",\"Descrição não preeenchida\",\"ok\"),\"--\")","v":"--"}]
[20,{"$f":"IFERROR(IF(VLOOKUP($A24,URLs!B$5:J$104,3,)<>0,VLOOKUP($A24,URLs!B$5:J$104,3,),\"\"),\"\")","v":""},{"$f":"IFERROR(IF(VLOOKUP($A24,URLs!B$5:J$104,9,)<>0,VLOOKUP($A24,URLs!B$5:J$104,9,),\"\"),\"\")","v":""},0,{"$f":"IF(C24<>\"\",IFERROR(IF(SEARCH($C24,URLs!E24,1),\"ok\"),\"Palavra-chave não encontrada no título\"),\"--\")","v":"--"},{"$f":"IF(C24<>\"\",IFERROR(IF(SEARCH(SUBSTITUTE(tiraAcento($C24),\" \",\"-\"),URLs!D24,1),\"ok\"),\"Palavra-chave não encontrada na URL\"),\"--\")","v":"--"},{"$f":"IF(C24<>\"\",IFERROR(IF(SEARCH($C24,URLs!K24,1),\"ok\"),\"Palavra-chave não encontrada no Título H1\"),\"--\")","v":"--"},{"$f":"IF(C24<>\"\",IFERROR(IF(SEARCH($C24,URLs!L24,1),\"ok\"),\"Palavra-chave não encontrada na imagem\"),\"--\")","v":"--"},{"$f":"IF(C24<>\"\",IF(URLs!H24=\"\",\"Descrição não preeenchida\",\"ok\"),\"--\")","v":"--"}]
[21,{"$f":"IFERROR(IF(VLOOKUP($A25,URLs!B$5:J$104,3,)<>0,VLOOKUP($A25,URLs!B$5:J$104,3,),\"\"),\"\")","v":""},{"$f":"IFERROR(IF(VLOOKUP($A25,URLs!B$5:J$104,9,)<>0,VLOOKUP($A25,URLs!B$5:J$104,9,),\"\"),\"\")","v":""},0,{"$f":"IF(C25<>\"\",IFERROR(IF(SEARCH($C25,URLs!E25,1),\"ok\"),\"Palavra-chave não encontrada no título\"),\"--\")","v":"--"},{"$f":"IF(C25<>\"\",IFERROR(IF(SEARCH(SUBSTITUTE(tiraAcento($C25),\" \",\"-\"),URLs!D25,1),\"ok\"),\"Palavra-chave não encontrada na URL\"),\"--\")","v":"--"},{"$f":"IF(C25<>\"\",IFERROR(IF(SEARCH($C25,URLs!K25,1),\"ok\"),\"Palavra-chave não encontrada no Título H1\"),\"--\")","v":"--"},{"$f":"IF(C25<>\"\",IFERROR(IF(SEARCH($C25,URLs!L25,1),\"ok\"),\"Palavra-chave não encontrada na imagem\"),\"--\")","v":"--"},{"$f":"IF(C25<>\"\",IF(URLs!H25=\"\",\"Descrição não preeenchida\",\"ok\"),\"--\")","v":"--"}]
[22,{"$f":"IFERROR(IF(VLOOKUP($A26,URLs!B$5:J$104,3,)<>0,VLOOKUP($A26,URLs!B$5:J$104,3,),\"\"),\"\")","v":""},{"$f":"IFERROR(IF(VLOOKUP($A26,URLs!B$5:J$104,9,)<>0,VLOOKUP($A26,URLs!B$5:J$104,9,),\"\"),\"\")","v":""},0,{"$f":"IF(C26<>\"\",IFERROR(IF(SEARCH($C26,URLs!E26,1),\"ok\"),\"Palavra-chave não encontrada no título\"),\"--\")","v":"--"},{"$f":"IF(C26<>\"\",IFERROR(IF(SEARCH(SUBSTITUTE(tiraAcento($C26),\" \",\"-\"),URLs!D26,1),\"ok\"),\"Palavra-chave não encontrada na URL\"),\"--\")","v":"--"},{"$f":"IF(C26<>\"\",IFERROR(IF(SEARCH($C26,URLs!K26,1),\"ok\"),\"Palavra-chave não encontrada no Título H1\"),\"--\")","v":"--"},{"$f":"IF(C26<>\"\",IFERROR(IF(SEARCH($C26,URLs!L26,1),\"ok\"),\"Palavra-chave não encontrada na imagem\"),\"--\")","v":"--"},{"$f":"IF(C26<>\"\",IF(URLs!H26=\"\",\"Descrição não preeenchida\",\"ok\"),\"--\")","v":"--"}]
[23,{"$f":"IFERROR(IF(VLOOKUP($A27,URLs!B$5:J$104,3,)<>0,VLOOKUP($A27,URLs!B$5:J$104,3,),\"\"),\"\")","v":""},{"$f":"IFERROR(IF(VLOOKUP($A27,URLs!B$5:J$104,9,)<>0,VLOOKUP($A27,URLs!B$5:J$104,9,),\"\"),\"\")","v":""},0,{"$f":"IF(C27<>\"\",IFERROR(IF(SEARCH($C27,URLs!E27,1),\"ok\"),\"Palavra-chave não encontrada no título\"),\"--\")","v":"--"},{"$f":"IF(C27<>\"\",IFERROR(IF(SEARCH(SUBSTITUTE(tiraAcento($C27),\" \",\"-\"),URLs!D27,1),\"ok\"),\"Palavra-chave não encontrada na URL\"),\"--\")","v":"--"},{"$f":"IF(C27<>\"\",IFERROR(IF(SEARCH($C27,URLs!K27,1),\"ok\"),\"Palavra-chave não encontrada no Título H1\"),\"--\")","v":"--"},{"$f":"IF(C27<>\"\",IFERROR(IF(SEARCH($C27,URLs!L27,1),\"ok\"),\"Palavra-chave não encontrada na imagem\"),\"--\")","v":"--"},{"$f":"IF(C27<>\"\",IF(URLs!H27=\"\",\"Descrição não preeenchida\",\"ok\"),\"--\")","v":"--"}]
[24,{"$f":"IFERROR(IF(VLOOKUP($A28,URLs!B$5:J$104,3,)<>0,VLOOKUP($A28,URLs!B$5:J$104,3,),\"\"),\"\")","v":""},{"$f":"IFERROR(IF(VLOOKUP($A28,URLs!B$5:J$104,9,)<>0,VLOOKUP($A28,URLs!B$5:J$104,9,),\"\"),\"\")","v":""},0,{"$f":"IF(C28<>\"\",IFERROR(IF(SEARCH($C28,URLs!E28,1),\"ok\"),\"Palavra-chave não encontrada no título\"),\"--\")","v":"--"},{"$f":"IF(C28<>\"\",IFERROR(IF(SEARCH(SUBSTITUTE(tiraAcento($C28),\" \",\"-\"),URLs!D28,1),\"ok\"),\"Palavra-chave não encontrada na URL\"),\"--\")","v":"--"},{"$f":"IF(C28<>\"\",IFERROR(IF(SEARCH($C28,URLs!K28,1),\"ok\"),\"Palavra-chave não encontrada no Título H1\"),\"--\")","v":"--"},{"$f":"IF(C28<>\"\",IFERROR(IF(SEARCH($C28,URLs!L28,1),\"ok\"),\"Palavra-chave não encontrada na imagem\"),\"--\")","v":"--"},{"$f":"IF(C28<>\"\",IF(URLs!H28=\"\",\"Descrição não preeenchida\",\"ok\"),\"--\")","v":"--"}]
[25,{"$f":"IFERROR(IF(VLOOKUP($A29,URLs!B$5:J$104,3,)<>0,VLOOKUP($A29,URLs!B$5:J$104,3,),\"\"),\"\")","v":""},{"$f":"IFERROR(IF(VLOOKUP($A29,URLs!B$5:J$104,9,)<>0,VLOOKUP($A29,URLs!B$5:J$104,9,),\"\"),\"\")","v":""},0,{"$f":"IF(C29<>\"\",IFERROR(IF(SEARCH($C29,URLs!E29,1),\"ok\"),\"Palavra-chave não encontrada no título\"),\"--\")","v":"--"},{"$f":"IF(C29<>\"\",IFERROR(IF(SEARCH(SUBSTITUTE(tiraAcento($C29),\" \",\"-\"),URLs!D29,1),\"ok\"),\"Palavra-chave não encontrada na URL\"),\"--\")","v":"--"},{"$f":"IF(C29<>\"\",IFERROR(IF(SEARCH($C29,URLs!K29,1),\"ok\"),\"Palavra-chave não encontrada no Título H1\"),\"--\")","v":"--"},{"$f":"IF(C29<>\"\",IFERROR(IF(SEARCH($C29,URLs!L29,1),\"ok\"),\"Palavra-chave não encontrada na imagem\"),\"--\")","v":"--"},{"$f":"IF(C29<>\"\",IF(URLs!H29=\"\",\"Descrição não preeenchida\",\"ok\"),\"--\")","v":"--"}]
[26,{"$f":"IFERROR(IF(VLOOKUP($A30,URLs!B$5:J$104,3,)<>0,VLOOKUP($A30,URLs!B$5:J$104,3,),\"\"),\"\")","v":""},{"$f":"IFERROR(IF(VLOOKUP($A30,URLs!B$5:J$104,9,)<>0,VLOOKUP($A30,URLs!B$5:J$104,9,),\"\"),\"\")","v":""},0,{"$f":"IF(C30<>\"\",IFERROR(IF(SEARCH($C30,URLs!E30,1),\"ok\"),\"Palavra-chave não encontrada no título\"),\"--\")","v":"--"},{"$f":"IF(C30<>\"\",IFERROR(IF(SEARCH(SUBSTITUTE(tiraAcento($C30),\" \",\"-\"),URLs!D30,1),\"ok\"),\"Palavra-chave não encontrada na URL\"),\"--\")","v":"--"},{"$f":"IF(C30<>\"\",IFERROR(IF(SEARCH($C30,URLs!K30,1),\"ok\"),\"Palavra-chave não encontrada no Título H1\"),\"--\")","v":"--"},{"$f":"IF(C30<>\"\",IFERROR(IF(SEARCH($C30,URLs!L30,1),\"ok\"),\"Palavra-chave não encontrada na imagem\"),\"--\")","v":"--"},{"$f":"IF(C30<>\"\",IF(URLs!H30=\"\",\"Descrição não preeenchida\",\"ok\"),\"--\")","v":"--"}]
[27,{"$f":"IFERROR(IF(VLOOKUP($A31,URLs!B$5:J$104,3,)<>0,VLOOKUP($A31,URLs!B$5:J$104,3,),\"\"),\"\")","v":""},{"$f":"IFERROR(IF(VLOOKUP($A31,URLs!B$5:J$104,9,)<>0,VLOOKUP($A31,URLs!B$5:J$104,9,),\"\"),\"\")","v":""},0,{"$f":"IF(C31<>\"\",IFERROR(IF(SEARCH($C31,URLs!E31,1),\"ok\"),\"Palavra-chave não encontrada no título\"),\"--\")","v":"--"},{"$f":"IF(C31<>\"\",IFERROR(IF(SEARCH(SUBSTITUTE(tiraAcento($C31),\" \",\"-\"),URLs!D31,1),\"ok\"),\"Palavra-chave não encontrada na URL\"),\"--\")","v":"--"},{"$f":"IF(C31<>\"\",IFERROR(IF(SEARCH($C31,URLs!K31,1),\"ok\"),\"Palavra-chave não encontrada no Título H1\"),\"--\")","v":"--"},{"$f":"IF(C31<>\"\",IFERROR(IF(SEARCH($C31,URLs!L31,1),\"ok\"),\"Palavra-chave não encontrada na imagem\"),\"--\")","v":"--"},{"$f":"IF(C31<>\"\",IF(URLs!H31=\"\",\"Descrição não preeenchida\",\"ok\"),\"--\")","v":"--"}]
[28,{"$f":"IFERROR(IF(VLOOKUP($A32,URLs!B$5:J$104,3,)<>0,VLOOKUP($A32,URLs!B$5:J$104,3,),\"\"),\"\")","v":""},{"$f":"IFERROR(IF(VLOOKUP($A32,URLs!B$5:J$104,9,)<>0,VLOOKUP($A32,URLs!B$5:J$104,9,),\"\"),\"\")","v":""},0,{"$f":"IF(C32<>\"\",IFERROR(IF(SEARCH($C32,URLs!E32,1),\"ok\"),\"Palavra-chave não encontrada no título\"),\"--\")","v":"--"},{"$f":"IF(C32<>\"\",IFERROR(IF(SEARCH(SUBSTITUTE(tiraAcento($C32),\" \",\"-\"),URLs!D32,1),\"ok\"),\"Palavra-chave não encontrada na URL\"),\"--\")","v":"--"},{"$f":"IF(C32<>\"\",IFERROR(IF(SEARCH($C32,URLs!K32,1),\"ok\"),\"Palavra-chave não encontrada no Título H1\"),\"--\")","v":"--"},{"$f":"IF(C32<>\"\",IFERROR(IF(SEARCH($C32,URLs!L32,1),\"ok\"),\"Palavra-chave não encontrada na imagem\"),\"--\")","v":"--"},{"$f":"IF(C32<>\"\",IF(URLs!H32=\"\",\"Descrição não preeenchida\",\"ok\"),\"--\")","v":"--"}]
[29,{"$f":"IFERROR(IF(VLOOKUP($A33,URLs!B$5:J$104,3,)<>0,VLOOKUP($A33,URLs!B$5:J$104,3,),\"\"),\"\")","v":""},{"$f":"IFERROR(IF(VLOOKUP($A33,URLs!B$5:J$104,9,)<>0,VLOOKUP($A33,URLs!B$5:J$104,9,),\"\"),\"\")","v":""},0,{"$f":"IF(C33<>\"\",IFERROR(IF(SEARCH($C33,URLs!E33,1),\"ok\"),\"Palavra-chave não encontrada no título\"),\"--\")","v":"--"},{"$f":"IF(C33<>\"\",IFERROR(IF(SEARCH(SUBSTITUTE(tiraAcento($C33),\" \",\"-\"),URLs!D33,1),\"ok\"),\"Palavra-chave não encontrada na URL\"),\"--\")","v":"--"},{"$f":"IF(C33<>\"\",IFERROR(IF(SEARCH($C33,URLs!K33,1),\"ok\"),\"Palavra-chave não encontrada no Título H1\"),\"--\")","v":"--"},{"$f":"IF(C33<>\"\",IFERROR(IF(SEARCH($C33,URLs!L33,1),\"ok\"),\"Palavra-chave não encontrada na imagem\"),\"--\")","v":"--"},{"$f":"IF(C33<>\"\",IF(URLs!H33=\"\",\"Descrição não preeenchida\",\"ok\"),\"--\")","v":"--"}]
[30,{"$f":"IFERROR(IF(VLOOKUP($A34,URLs!B$5:J$104,3,)<>0,VLOOKUP($A34,URLs!B$5:J$104,3,),\"\"),\"\")","v":""},{"$f":"IFERROR(IF(VLOOKUP($A34,URLs!B$5:J$104,9,)<>0,VLOOKUP($A34,URLs!B$5:J$104,9,),\"\"),\"\")","v":""},0,{"$f":"IF(C34<>\"\",IFERROR(IF(SEARCH($C34,URLs!E34,1),\"ok\"),\"Palavra-chave não encontrada no título\"),\"--\")","v":"--"},{"$f":"IF(C34<>\"\",IFERROR(IF(SEARCH(SUBSTITUTE(tiraAcento($C34),\" \",\"-\"),URLs!D34,1),\"ok\"),\"Palavra-chave não encontrada na URL\"),\"--\")","v":"--"},{"$f":"IF(C34<>\"\",IFERROR(IF(SEARCH($C34,URLs!K34,1),\"ok\"),\"Palavra-chave não encontrada no Título H1\"),\"--\")","v":"--"},{"$f":"IF(C34<>\"\",IFERROR(IF(SEARCH($C34,URLs!L34,1),\"ok\"),\"Palavra-chave não encontrada na imagem\"),\"--\")","v":"--"},{"$f":"IF(C34<>\"\",IF(URLs!H34=\"\",\"Descrição não preeenchida\",\"ok\"),\"--\")","v":"--"}]
[31,{"$f":"IFERROR(IF(VLOOKUP($A35,URLs!B$5:J$104,3,)<>0,VLOOKUP($A35,URLs!B$5:J$104,3,),\"\"),\"\")","v":""},{"$f":"IFERROR(IF(VLOOKUP($A35,URLs!B$5:J$104,9,)<>0,VLOOKUP($A35,URLs!B$5:J$104,9,),\"\"),\"\")","v":""},0,{"$f":"IF(C35<>\"\",IFERROR(IF(SEARCH($C35,URLs!E35,1),\"ok\"),\"Palavra-chave não encontrada no título\"),\"--\")","v":"--"},{"$f":"IF(C35<>\"\",IFERROR(IF(SEARCH(SUBSTITUTE(tiraAcento($C35),\" \",\"-\"),URLs!D35,1),\"ok\"),\"Palavra-chave não encontrada na URL\"),\"--\")","v":"--"},{"$f":"IF(C35<>\"\",IFERROR(IF(SEARCH($C35,URLs!K35,1),\"ok\"),\"Palavra-chave não encontrada no Título H1\"),\"--\")","v":"--"},{"$f":"IF(C35<>\"\",IFERROR(IF(SEARCH($C35,URLs!L35,1),\"ok\"),\"Palavra-chave não encontrada na imagem\"),\"--\")","v":"--"},{"$f":"IF(C35<>\"\",IF(URLs!H35=\"\",\"Descrição não preeenchida\",\"ok\"),\"--\")","v":"--"}]
[32,{"$f":"IFERROR(IF(VLOOKUP($A36,URLs!B$5:J$104,3,)<>0,VLOOKUP($A36,URLs!B$5:J$104,3,),\"\"),\"\")","v":""},{"$f":"IFERROR(IF(VLOOKUP($A36,URLs!B$5:J$104,9,)<>0,VLOOKUP($A36,URLs!B$5:J$104,9,),\"\"),\"\")","v":""},0,{"$f":"IF(C36<>\"\",IFERROR(IF(SEARCH($C36,URLs!E36,1),\"ok\"),\"Palavra-chave não encontrada no título\"),\"--\")","v":"--"},{"$f":"IF(C36<>\"\",IFERROR(IF(SEARCH(SUBSTITUTE(tiraAcento($C36),\" \",\"-\"),URLs!D36,1),\"ok\"),\"Palavra-chave não encontrada na URL\"),\"--\")","v":"--"},{"$f":"IF(C36<>\"\",IFERROR(IF(SEARCH($C36,URLs!K36,1),\"ok\"),\"Palavra-chave não encontrada no Título H1\"),\"--\")","v":"--"},{"$f":"IF(C36<>\"\",IFERROR(IF(SEARCH($C36,URLs!L36,1),\"ok\"),\"Palavra-chave não encontrada na imagem\"),\"--\")","v":"--"},{"$f":"IF(C36<>\"\",IF(URLs!H36=\"\",\"Descrição não preeenchida\",\"ok\"),\"--\")","v":"--"}]
[33,{"$f":"IFERROR(IF(VLOOKUP($A37,URLs!B$5:J$104,3,)<>0,VLOOKUP($A37,URLs!B$5:J$104,3,),\"\"),\"\")","v":""},{"$f":"IFERROR(IF(VLOOKUP($A37,URLs!B$5:J$104,9,)<>0,VLOOKUP($A37,URLs!B$5:J$104,9,),\"\"),\"\")","v":""},0,{"$f":"IF(C37<>\"\",IFERROR(IF(SEARCH($C37,URLs!E37,1),\"ok\"),\"Palavra-chave não encontrada no título\"),\"--\")","v":"--"},{"$f":"IF(C37<>\"\",IFERROR(IF(SEARCH(SUBSTITUTE(tiraAcento($C37),\" \",\"-\"),URLs!D37,1),\"ok\"),\"Palavra-chave não encontrada na URL\"),\"--\")","v":"--"},{"$f":"IF(C37<>\"\",IFERROR(IF(SEARCH($C37,URLs!K37,1),\"ok\"),\"Palavra-chave não encontrada no Título H1\"),\"--\")","v":"--"},{"$f":"IF(C37<>\"\",IFERROR(IF(SEARCH($C37,URLs!L37,1),\"ok\"),\"Palavra-chave não encontrada na imagem\"),\"--\")","v":"--"},{"$f":"IF(C37<>\"\",IF(URLs!H37=\"\",\"Descrição não preeenchida\",\"ok\"),\"--\")","v":"--"}]
[34,{"$f":"IFERROR(IF(VLOOKUP($A38,URLs!B$5:J$104,3,)<>0,VLOOKUP($A38,URLs!B$5:J$104,3,),\"\"),\"\")","v":""},{"$f":"IFERROR(IF(VLOOKUP($A38,URLs!B$5:J$104,9,)<>0,VLOOKUP($A38,URLs!B$5:J$104,9,),\"\"),\"\")","v":""},0,{"$f":"IF(C38<>\"\",IFERROR(IF(SEARCH($C38,URLs!E38,1),\"ok\"),\"Palavra-chave não encontrada no título\"),\"--\")","v":"--"},{"$f":"IF(C38<>\"\",IFERROR(IF(SEARCH(SUBSTITUTE(tiraAcento($C38),\" \",\"-\"),URLs!D38,1),\"ok\"),\"Palavra-chave não encontrada na URL\"),\"--\")","v":"--"},{"$f":"IF(C38<>\"\",IFERROR(IF(SEARCH($C38,URLs!K38,1),\"ok\"),\"Palavra-chave não encontrada no Título H1\"),\"--\")","v":"--"},{"$f":"IF(C38<>\"\",IFERROR(IF(SEARCH($C38,URLs!L38,1),\"ok\"),\"Palavra-chave não encontrada na imagem\"),\"--\")","v":"--"},{"$f":"IF(C38<>\"\",IF(URLs!H38=\"\",\"Descrição não preeenchida\",\"ok\"),\"--\")","v":"--"}]
[35,{"$f":"IFERROR(IF(VLOOKUP($A39,URLs!B$5:J$104,3,)<>0,VLOOKUP($A39,URLs!B$5:J$104,3,),\"\"),\"\")","v":""},{"$f":"IFERROR(IF(VLOOKUP($A39,URLs!B$5:J$104,9,)<>0,VLOOKUP($A39,URLs!B$5:J$104,9,),\"\"),\"\")","v":""},0,{"$f":"IF(C39<>\"\",IFERROR(IF(SEARCH($C39,URLs!E39,1),\"ok\"),\"Palavra-chave não encontrada no título\"),\"--\")","v":"--"},{"$f":"IF(C39<>\"\",IFERROR(IF(SEARCH(SUBSTITUTE(tiraAcento($C39),\" \",\"-\"),URLs!D39,1),\"ok\"),\"Palavra-chave não encontrada na URL\"),\"--\")","v":"--"},{"$f":"IF(C39<>\"\",IFERROR(IF(SEARCH($C39,URLs!K39,1),\"ok\"),\"Palavra-chave não encontrada no Título H1\"),\"--\")","v":"--"},{"$f":"IF(C39<>\"\",IFERROR(IF(SEARCH($C39,URLs!L39,1),\"ok\"),\"Palavra-chave não encontrada na imagem\"),\"--\")","v":"--"},{"$f":"IF(C39<>\"\",IF(URLs!H39=\"\",\"Descrição não preeenchida\",\"ok\"),\"--\")","v":"--"}]
[36,{"$f":"IFERROR(IF(VLOOKUP($A40,URLs!B$5:J$104,3,)<>0,VLOOKUP($A40,URLs!B$5:J$104,3,),\"\"),\"\")","v":""},{"$f":"IFERROR(IF(VLOOKUP($A40,URLs!B$5:J$104,9,)<>0,VLOOKUP($A40,URLs!B$5:J$104,9,),\"\"),\"\")","v":""},0,{"$f":"IF(C40<>\"\",IFERROR(IF(SEARCH($C40,URLs!E40,1),\"ok\"),\"Palavra-chave não encontrada no título\"),\"--\")","v":"--"},{"$f":"IF(C40<>\"\",IFERROR(IF(SEARCH(SUBSTITUTE(tiraAcento($C40),\" \",\"-\"),URLs!D40,1),\"ok\"),\"Palavra-chave não encontrada na URL\"),\"--\")","v":"--"},{"$f":"IF(C40<>\"\",IFERROR(IF(SEARCH($C40,URLs!K40,1),\"ok\"),\"Palavra-chave não encontrada no Título H1\"),\"--\")","v":"--"},{"$f":"IF(C40<>\"\",IFERROR(IF(SEARCH($C40,URLs!L40,1),\"ok\"),\"Palavra-chave não encontrada na imagem\"),\"--\")","v":"--"},{"$f":"IF(C40<>\"\",IF(URLs!H40=\"\",\"Descrição não preeenchida\",\"ok\"),\"--\")","v":"--"}]
[37,{"$f":"IFERROR(IF(VLOOKUP($A41,URLs!B$5:J$104,3,)<>0,VLOOKUP($A41,URLs!B$5:J$104,3,),\"\"),\"\")","v":""},{"$f":"IFERROR(IF(VLOOKUP($A41,URLs!B$5:J$104,9,)<>0,VLOOKUP($A41,URLs!B$5:J$104,9,),\"\"),\"\")","v":""},0,{"$f":"IF(C41<>\"\",IFERROR(IF(SEARCH($C41,URLs!E41,1),\"ok\"),\"Palavra-chave não encontrada no título\"),\"--\")","v":"--"},{"$f":"IF(C41<>\"\",IFERROR(IF(SEARCH(SUBSTITUTE(tiraAcento($C41),\" \",\"-\"),URLs!D41,1),\"ok\"),\"Palavra-chave não encontrada na URL\"),\"--\")","v":"--"},{"$f":"IF(C41<>\"\",IFERROR(IF(SEARCH($C41,URLs!K41,1),\"ok\"),\"Palavra-chave não encontrada no Título H1\"),\"--\")","v":"--"},{"$f":"IF(C41<>\"\",IFERROR(IF(SEARCH($C41,URLs!L41,1),\"ok\"),\"Palavra-chave não encontrada na imagem\"),\"--\")","v":"--"},{"$f":"IF(C41<>\"\",IF(URLs!H41=\"\",\"Descrição não preeenchida\",\"ok\"),\"--\")","v":"--"}]
[38,{"$f":"IFERROR(IF(VLOOKUP($A42,URLs!B$5:J$104,3,)<>0,VLOOKUP($A42,URLs!B$5:J$104,3,),\"\"),\"\")","v":""},{"$f":"IFERROR(IF(VLOOKUP($A42,URLs!B$5:J$104,9,)<>0,VLOOKUP($A42,URLs!B$5:J$104,9,),\"\"),\"\")","v":""},0,{"$f":"IF(C42<>\"\",IFERROR(IF(SEARCH($C42,URLs!E42,1),\"ok\"),\"Palavra-chave não encontrada no título\"),\"--\")","v":"--"},{"$f":"IF(C42<>\"\",IFERROR(IF(SEARCH(SUBSTITUTE(tiraAcento($C42),\" \",\"-\"),URLs!D42,1),\"ok\"),\"Palavra-chave não encontrada na URL\"),\"--\")","v":"--"},{"$f":"IF(C42<>\"\",IFERROR(IF(SEARCH($C42,URLs!K42,1),\"ok\"),\"Palavra-chave não encontrada no Título H1\"),\"--\")","v":"--"},{"$f":"IF(C42<>\"\",IFERROR(IF(SEARCH($C42,URLs!L42,1),\"ok\"),\"Palavra-chave não encontrada na imagem\"),\"--\")","v":"--"},{"$f":"IF(C42<>\"\",IF(URLs!H42=\"\",\"Descrição não preeenchida\",\"ok\"),\"--\")","v":"--"}]
[39,{"$f":"IFERROR(IF(VLOOKUP($A43,URLs!B$5:J$104,3,)<>0,VLOOKUP($A43,URLs!B$5:J$104,3,),\"\"),\"\")","v":""},{"$f":"IFERROR(IF(VLOOKUP($A43,URLs!B$5:J$104,9,)<>0,VLOOKUP($A43,URLs!B$5:J$104,9,),\"\"),\"\")","v":""},0,{"$f":"IF(C43<>\"\",IFERROR(IF(SEARCH($C43,URLs!E43,1),\"ok\"),\"Palavra-chave não encontrada no título\"),\"--\")","v":"--"},{"$f":"IF(C43<>\"\",IFERROR(IF(SEARCH(SUBSTITUTE(tiraAcento($C43),\" \",\"-\"),URLs!D43,1),\"ok\"),\"Palavra-chave não encontrada na URL\"),\"--\")","v":"--"},{"$f":"IF(C43<>\"\",IFERROR(IF(SEARCH($C43,URLs!K43,1),\"ok\"),\"Palavra-chave não encontrada no Título H1\"),\"--\")","v":"--"},{"$f":"IF(C43<>\"\",IFERROR(IF(SEARCH($C43,URLs!L43,1),\"ok\"),\"Palavra-chave não encontrada na imagem\"),\"--\")","v":"--"},{"$f":"IF(C43<>\"\",IF(URLs!H43=\"\",\"Descrição não preeenchida\",\"ok\"),\"--\")","v":"--"}]
[40,{"$f":"IFERROR(IF(VLOOKUP($A44,URLs!B$5:J$104,3,)<>0,VLOOKUP($A44,URLs!B$5:J$104,3,),\"\"),\"\")","v":""},{"$f":"IFERROR(IF(VLOOKUP($A44,URLs!B$5:J$104,9,)<>0,VLOOKUP($A44,URLs!B$5:J$104,9,),\"\"),\"\")","v":""},0,{"$f":"IF(C44<>\"\",IFERROR(IF(SEARCH($C44,URLs!E44,1),\"ok\"),\"Palavra-chave não encontrada no título\"),\"--\")","v":"--"},{"$f":"IF(C44<>\"\",IFERROR(IF(SEARCH(SUBSTITUTE(tiraAcento($C44),\" \",\"-\"),URLs!D44,1),\"ok\"),\"Palavra-chave não encontrada na URL\"),\"--\")","v":"--"},{"$f":"IF(C44<>\"\",IFERROR(IF(SEARCH($C44,URLs!K44,1),\"ok\"),\"Palavra-chave não encontrada no Título H1\"),\"--\")","v":"--"},{"$f":"IF(C44<>\"\",IFERROR(IF(SEARCH($C44,URLs!L44,1),\"ok\"),\"Palavra-chave não encontrada na imagem\"),\"--\")","v":"--"},{"$f":"IF(C44<>\"\",IF(URLs!H44=\"\",\"Descrição não preeenchida\",\"ok\"),\"--\")","v":"--"}]
[41,{"$f":"IFERROR(IF(VLOOKUP($A45,URLs!B$5:J$104,3,)<>0,VLOOKUP($A45,URLs!B$5:J$104,3,),\"\"),\"\")","v":""},{"$f":"IFERROR(IF(VLOOKUP($A45,URLs!B$5:J$104,9,)<>0,VLOOKUP($A45,URLs!B$5:J$104,9,),\"\"),\"\")","v":""},0,{"$f":"IF(C45<>\"\",IFERROR(IF(SEARCH($C45,URLs!E45,1),\"ok\"),\"Palavra-chave não encontrada no título\"),\"--\")","v":"--"},{"$f":"IF(C45<>\"\",IFERROR(IF(SEARCH(SUBSTITUTE(tiraAcento($C45),\" \",\"-\"),URLs!D45,1),\"ok\"),\"Palavra-chave não encontrada na URL\"),\"--\")","v":"--"},{"$f":"IF(C45<>\"\",IFERROR(IF(SEARCH($C45,URLs!K45,1),\"ok\"),\"Palavra-chave não encontrada no Título H1\"),\"--\")","v":"--"},{"$f":"IF(C45<>\"\",IFERROR(IF(SEARCH($C45,URLs!L45,1),\"ok\"),\"Palavra-chave não encontrada na imagem\"),\"--\")","v":"--"},{"$f":"IF(C45<>\"\",IF(URLs!H45=\"\",\"Descrição não preeenchida\",\"ok\"),\"--\")","v":"--"}]
[42,{"$f":"IFERROR(IF(VLOOKUP($A46,URLs!B$5:J$104,3,)<>0,VLOOKUP($A46,URLs!B$5:J$104,3,),\"\"),\"\")","v":""},{"$f":"IFERROR(IF(VLOOKUP($A46,URLs!B$5:J$104,9,)<>0,VLOOKUP($A46,URLs!B$5:J$104,9,),\"\"),\"\")","v":""},0,{"$f":"IF(C46<>\"\",IFERROR(IF(SEARCH($C46,URLs!E46,1),\"ok\"),\"Palavra-chave não encontrada no título\"),\"--\")","v":"--"},{"$f":"IF(C46<>\"\",IFERROR(IF(SEARCH(SUBSTITUTE(tiraAcento($C46),\" \",\"-\"),URLs!D46,1),\"ok\"),\"Palavra-chave não encontrada na URL\"),\"--\")","v":"--"},{"$f":"IF(C46<>\"\",IFERROR(IF(SEARCH($C46,URLs!K46,1),\"ok\"),\"Palavra-chave não encontrada no Título H1\"),\"--\")","v":"--"},{"$f":"IF(C46<>\"\",IFERROR(IF(SEARCH($C46,URLs!L46,1),\"ok\"),\"Palavra-chave não encontrada na imagem\"),\"--\")","v":"--"},{"$f":"IF(C46<>\"\",IF(URLs!H46=\"\",\"Descrição não preeenchida\",\"ok\"),\"--\")","v":"--"}]
[43,{"$f":"IFERROR(IF(VLOOKUP($A47,URLs!B$5:J$104,3,)<>0,VLOOKUP($A47,URLs!B$5:J$104,3,),\"\"),\"\")","v":""},{"$f":"IFERROR(IF(VLOOKUP($A47,URLs!B$5:J$104,9,)<>0,VLOOKUP($A47,URLs!B$5:J$104,9,),\"\"),\"\")","v":""},0,{"$f":"IF(C47<>\"\",IFERROR(IF(SEARCH($C47,URLs!E47,1),\"ok\"),\"Palavra-chave não encontrada no título\"),\"--\")","v":"--"},{"$f":"IF(C47<>\"\",IFERROR(IF(SEARCH(SUBSTITUTE(tiraAcento($C47),\" \",\"-\"),URLs!D47,1),\"ok\"),\"Palavra-chave não encontrada na URL\"),\"--\")","v":"--"},{"$f":"IF(C47<>\"\",IFERROR(IF(SEARCH($C47,URLs!K47,1),\"ok\"),\"Palavra-chave não encontrada no Título H1\"),\"--\")","v":"--"},{"$f":"IF(C47<>\"\",IFERROR(IF(SEARCH($C47,URLs!L47,1),\"ok\"),\"Palavra-chave não encontrada na imagem\"),\"--\")","v":"--"},{"$f":"IF(C47<>\"\",IF(URLs!H47=\"\",\"Descrição não preeenchida\",\"ok\"),\"--\")","v":"--"}]
[44,{"$f":"IFERROR(IF(VLOOKUP($A48,URLs!B$5:J$104,3,)<>0,VLOOKUP($A48,URLs!B$5:J$104,3,),\"\"),\"\")","v":""},{"$f":"IFERROR(IF(VLOOKUP($A48,URLs!B$5:J$104,9,)<>0,VLOOKUP($A48,URLs!B$5:J$104,9,),\"\"),\"\")","v":""},0,{"$f":"IF(C48<>\"\",IFERROR(IF(SEARCH($C48,URLs!E48,1),\"ok\"),\"Palavra-chave não encontrada no título\"),\"--\")","v":"--"},{"$f":"IF(C48<>\"\",IFERROR(IF(SEARCH(SUBSTITUTE(tiraAcento($C48),\" \",\"-\"),URLs!D48,1),\"ok\"),\"Palavra-chave não encontrada na URL\"),\"--\")","v":"--"},{"$f":"IF(C48<>\"\",IFERROR(IF(SEARCH($C48,URLs!K48,1),\"ok\"),\"Palavra-chave não encontrada no Título H1\"),\"--\")","v":"--"},{"$f":"IF(C48<>\"\",IFERROR(IF(SEARCH($C48,URLs!L48,1),\"ok\"),\"Palavra-chave não encontrada na imagem\"),\"--\")","v":"--"},{"$f":"IF(C48<>\"\",IF(URLs!H48=\"\",\"Descrição não preeenchida\",\"ok\"),\"--\")","v":"--"}]
[45,{"$f":"IFERROR(IF(VLOOKUP($A49,URLs!B$5:J$104,3,)<>0,VLOOKUP($A49,URLs!B$5:J$104,3,),\"\"),\"\")","v":""},{"$f":"IFERROR(IF(VLOOKUP($A49,URLs!B$5:J$104,9,)<>0,VLOOKUP($A49,URLs!B$5:J$104,9,),\"\"),\"\")","v":""},0,{"$f":"IF(C49<>\"\",IFERROR(IF(SEARCH($C49,URLs!E49,1),\"ok\"),\"Palavra-chave não encontrada no título\"),\"--\")","v":"--"},{"$f":"IF(C49<>\"\",IFERROR(IF(SEARCH(SUBSTITUTE(tiraAcento($C49),\" \",\"-\"),URLs!D49,1),\"ok\"),\"Palavra-chave não encontrada na URL\"),\"--\")","v":"--"},{"$f":"IF(C49<>\"\",IFERROR(IF(SEARCH($C49,URLs!K49,1),\"ok\"),\"Palavra-chave não encontrada no Título H1\"),\"--\")","v":"--"},{"$f":"IF(C49<>\"\",IFERROR(IF(SEARCH($C49,URLs!L49,1),\"ok\"),\"Palavra-chave não encontrada na imagem\"),\"--\")","v":"--"},{"$f":"IF(C49<>\"\",IF(URLs!H49=\"\",\"Descrição não preeenchida\",\"ok\"),\"--\")","v":"--"}]
[46,{"$f":"IFERROR(IF(VLOOKUP($A50,URLs!B$5:J$104,3,)<>0,VLOOKUP($A50,URLs!B$5:J$104,3,),\"\"),\"\")","v":""},{"$f":"IFERROR(IF(VLOOKUP($A50,URLs!B$5:J$104,9,)<>0,VLOOKUP($A50,URLs!B$5:J$104,9,),\"\"),\"\")","v":""},0,{"$f":"IF(C50<>\"\",IFERROR(IF(SEARCH($C50,URLs!E50,1),\"ok\"),\"Palavra-chave não encontrada no título\"),\"--\")","v":"--"},{"$f":"IF(C50<>\"\",IFERROR(IF(SEARCH(SUBSTITUTE(tiraAcento($C50),\" \",\"-\"),URLs!D50,1),\"ok\"),\"Palavra-chave não encontrada na URL\"),\"--\")","v":"--"},{"$f":"IF(C50<>\"\",IFERROR(IF(SEARCH($C50,URLs!K50,1),\"ok\"),\"Palavra-chave não encontrada no Título H1\"),\"--\")","v":"--"},{"$f":"IF(C50<>\"\",IFERROR(IF(SEARCH($C50,URLs!L50,1),\"ok\"),\"Palavra-chave não encontrada na imagem\"),\"--\")","v":"--"},{"$f":"IF(C50<>\"\",IF(URLs!H50=\"\",\"Descrição não preeenchida\",\"ok\"),\"--\")","v":"--"}]
[47,{"$f":"IFERROR(IF(VLOOKUP($A51,URLs!B$5:J$104,3,)<>0,VLOOKUP($A51,URLs!B$5:J$104,3,),\"\"),\"\")","v":""},{"$f":"IFERROR(IF(VLOOKUP($A51,URLs!B$5:J$104,9,)<>0,VLOOKUP($A51,URLs!B$5:J$104,9,),\"\"),\"\")","v":""},0,{"$f":"IF(C51<>\"\",IFERROR(IF(SEARCH($C51,URLs!E51,1),\"ok\"),\"Palavra-chave não encontrada no título\"),\"--\")","v":"--"},{"$f":"IF(C51<>\"\",IFERROR(IF(SEARCH(SUBSTITUTE(tiraAcento($C51),\" \",\"-\"),URLs!D51,1),\"ok\"),\"Palavra-chave não encontrada na URL\"),\"--\")","v":"--"},{"$f":"IF(C51<>\"\",IFERROR(IF(SEARCH($C51,URLs!K51,1),\"ok\"),\"Palavra-chave não encontrada no Título H1\"),\"--\")","v":"--"},{"$f":"IF(C51<>\"\",IFERROR(IF(SEARCH($C51,URLs!L51,1),\"ok\"),\"Palavra-chave não encontrada na imagem\"),\"--\")","v":"--"},{"$f":"IF(C51<>\"\",IF(URLs!H51=\"\",\"Descrição não preeenchida\",\"ok\"),\"--\")","v":"--"}]
[48,{"$f":"IFERROR(IF(VLOOKUP($A52,URLs!B$5:J$104,3,)<>0,VLOOKUP($A52,URLs!B$5:J$104,3,),\"\"),\"\")","v":""},{"$f":"IFERROR(IF(VLOOKUP($A52,URLs!B$5:J$104,9,)<>0,VLOOKUP($A52,URLs!B$5:J$104,9,),\"\"),\"\")","v":""},0,{"$f":"IF(C52<>\"\",IFERROR(IF(SEARCH($C52,URLs!E52,1),\"ok\"),\"Palavra-chave não encontrada no título\"),\"--\")","v":"--"},{"$f":"IF(C52<>\"\",IFERROR(IF(SEARCH(SUBSTITUTE(tiraAcento($C52),\" \",\"-\"),URLs!D52,1),\"ok\"),\"Palavra-chave não encontrada na URL\"),\"--\")","v":"--"},{"$f":"IF(C52<>\"\",IFERROR(IF(SEARCH($C52,URLs!K52,1),\"ok\"),\"Palavra-chave não encontrada no Título H1\"),\"--\")","v":"--"},{"$f":"IF(C52<>\"\",IFERROR(IF(SEARCH($C52,URLs!L52,1),\"ok\"),\"Palavra-chave não encontrada na imagem\"),\"--\")","v":"--"},{"$f":"IF(C52<>\"\",IF(URLs!H52=\"\",\"Descrição não preeenchida\",\"ok\"),\"--\")","v":"--"}]
[49,{"$f":"IFERROR(IF(VLOOKUP($A53,URLs!B$5:J$104,3,)<>0,VLOOKUP($A53,URLs!B$5:J$104,3,),\"\"),\"\")","v":""},{"$f":"IFERROR(IF(VLOOKUP($A53,URLs!B$5:J$104,9,)<>0,VLOOKUP($A53,URLs!B$5:J$104,9,),\"\"),\"\")","v":""},0,{"$f":"IF(C53<>\"\",IFERROR(IF(SEARCH($C53,URLs!E53,1),\"ok\"),\"Palavra-chave não encontrada no título\"),\"--\")","v":"--"},{"$f":"IF(C53<>\"\",IFERROR(IF(SEARCH(SUBSTITUTE(tiraAcento($C53),\" \",\"-\"),URLs!D53,1),\"ok\"),\"Palavra-chave não encontrada na URL\"),\"--\")","v":"--"},{"$f":"IF(C53<>\"\",IFERROR(IF(SEARCH($C53,URLs!K53,1),\"ok\"),\"Palavra-chave não encontrada no Título H1\"),\"--\")","v":"--"},{"$f":"IF(C53<>\"\",IFERROR(IF(SEARCH($C53,URLs!L53,1),\"ok\"),\"Palavra-chave não encontrada na imagem\"),\"--\")","v":"--"},{"$f":"IF(C53<>\"\",IF(URLs!H53=\"\",\"Descrição não preeenchida\",\"ok\"),\"--\")","v":"--"}]
[50,{"$f":"IFERROR(IF(VLOOKUP($A54,URLs!B$5:J$104,3,)<>0,VLOOKUP($A54,URLs!B$5:J$104,3,),\"\"),\"\")","v":""},{"$f":"IFERROR(IF(VLOOKUP($A54,URLs!B$5:J$104,9,)<>0,VLOOKUP($A54,URLs!B$5:J$104,9,),\"\"),\"\")","v":""},0,{"$f":"IF(C54<>\"\",IFERROR(IF(SEARCH($C54,URLs!E54,1),\"ok\"),\"Palavra-chave não encontrada no título\"),\"--\")","v":"--"},{"$f":"IF(C54<>\"\",IFERROR(IF(SEARCH(SUBSTITUTE(tiraAcento($C54),\" \",\"-\"),URLs!D54,1),\"ok\"),\"Palavra-chave não encontrada na URL\"),\"--\")","v":"--"},{"$f":"IF(C54<>\"\",IFERROR(IF(SEARCH($C54,URLs!K54,1),\"ok\"),\"Palavra-chave não encontrada no Título H1\"),\"--\")","v":"--"},{"$f":"IF(C54<>\"\",IFERROR(IF(SEARCH($C54,URLs!L54,1),\"ok\"),\"Palavra-chave não encontrada na imagem\"),\"--\")","v":"--"},{"$f":"IF(C54<>\"\",IF(URLs!H54=\"\",\"Descrição não preeenchida\",\"ok\"),\"--\")","v":"--"}]
[51,{"$f":"IFERROR(IF(VLOOKUP($A55,URLs!B$5:J$104,3,)<>0,VLOOKUP($A55,URLs!B$5:J$104,3,),\"\"),\"\")","v":""},{"$f":"IFERROR(IF(VLOOKUP($A55,URLs!B$5:J$104,9,)<>0,VLOOKUP($A55,URLs!B$5:J$104,9,),\"\"),\"\")","v":""},0,{"$f":"IF(C55<>\"\",IFERROR(IF(SEARCH($C55,URLs!E55,1),\"ok\"),\"Palavra-chave não encontrada no título\"),\"--\")","v":"--"},{"$f":"IF(C55<>\"\",IFERROR(IF(SEARCH(SUBSTITUTE(tiraAcento($C55),\" \",\"-\"),URLs!D55,1),\"ok\"),\"Palavra-chave não encontrada na URL\"),\"--\")","v":"--"},{"$f":"IF(C55<>\"\",IFERROR(IF(SEARCH($C55,URLs!K55,1),\"ok\"),\"Palavra-chave não encontrada no Título H1\"),\"--\")","v":"--"},{"$f":"IF(C55<>\"\",IFERROR(IF(SEARCH($C55,URLs!L55,1),\"ok\"),\"Palavra-chave não encontrada na imagem\"),\"--\")","v":"--"},{"$f":"IF(C55<>\"\",IF(URLs!H55=\"\",\"Descrição não preeenchida\",\"ok\"),\"--\")","v":"--"}]
[52,{"$f":"IFERROR(IF(VLOOKUP($A56,URLs!B$5:J$104,3,)<>0,VLOOKUP($A56,URLs!B$5:J$104,3,),\"\"),\"\")","v":""},{"$f":"IFERROR(IF(VLOOKUP($A56,URLs!B$5:J$104,9,)<>0,VLOOKUP($A56,URLs!B$5:J$104,9,),\"\"),\"\")","v":""},0,{"$f":"IF(C56<>\"\",IFERROR(IF(SEARCH($C56,URLs!E56,1),\"ok\"),\"Palavra-chave não encontrada no título\"),\"--\")","v":"--"},{"$f":"IF(C56<>\"\",IFERROR(IF(SEARCH(SUBSTITUTE(tiraAcento($C56),\" \",\"-\"),URLs!D56,1),\"ok\"),\"Palavra-chave não encontrada na URL\"),\"--\")","v":"--"},{"$f":"IF(C56<>\"\",IFERROR(IF(SEARCH($C56,URLs!K56,1),\"ok\"),\"Palavra-chave não encontrada no Título H1\"),\"--\")","v":"--"},{"$f":"IF(C56<>\"\",IFERROR(IF(SEARCH($C56,URLs!L56,1),\"ok\"),\"Palavra-chave não encontrada na imagem\"),\"--\")","v":"--"},{"$f":"IF(C56<>\"\",IF(URLs!H56=\"\",\"Descrição não preeenchida\",\"ok\"),\"--\")","v":"--"}]
[53,{"$f":"IFERROR(IF(VLOOKUP($A57,URLs!B$5:J$104,3,)<>0,VLOOKUP($A57,URLs!B$5:J$104,3,),\"\"),\"\")","v":""},{"$f":"IFERROR(IF(VLOOKUP($A57,URLs!B$5:J$104,9,)<>0,VLOOKUP($A57,URLs!B$5:J$104,9,),\"\"),\"\")","v":""},0,{"$f":"IF(C57<>\"\",IFERROR(IF(SEARCH($C57,URLs!E57,1),\"ok\"),\"Palavra-chave não encontrada no título\"),\"--\")","v":"--"},{"$f":"IF(C57<>\"\",IFERROR(IF(SEARCH(SUBSTITUTE(tiraAcento($C57),\" \",\"-\"),URLs!D57,1),\"ok\"),\"Palavra-chave não encontrada na URL\"),\"--\")","v":"--"},{"$f":"IF(C57<>\"\",IFERROR(IF(SEARCH($C57,URLs!K57,1),\"ok\"),\"Palavra-chave não encontrada no Título H1\"),\"--\")","v":"--"},{"$f":"IF(C57<>\"\",IFERROR(IF(SEARCH($C57,URLs!L57,1),\"ok\"),\"Palavra-chave não encontrada na imagem\"),\"--\")","v":"--"},{"$f":"IF(C57<>\"\",IF(URLs!H57=\"\",\"Descrição não preeenchida\",\"ok\"),\"--\")","v":"--"}]
[54,{"$f":"IFERROR(IF(VLOOKUP($A58,URLs!B$5:J$104,3,)<>0,VLOOKUP($A58,URLs!B$5:J$104,3,),\"\"),\"\")","v":""},{"$f":"IFERROR(IF(VLOOKUP($A58,URLs!B$5:J$104,9,)<>0,VLOOKUP($A58,URLs!B$5:J$104,9,),\"\"),\"\")","v":""},0,{"$f":"IF(C58<>\"\",IFERROR(IF(SEARCH($C58,URLs!E58,1),\"ok\"),\"Palavra-chave não encontrada no título\"),\"--\")","v":"--"},{"$f":"IF(C58<>\"\",IFERROR(IF(SEARCH(SUBSTITUTE(tiraAcento($C58),\" \",\"-\"),URLs!D58,1),\"ok\"),\"Palavra-chave não encontrada na URL\"),\"--\")","v":"--"},{"$f":"IF(C58<>\"\",IFERROR(IF(SEARCH($C58,URLs!K58,1),\"ok\"),\"Palavra-chave não encontrada no Título H1\"),\"--\")","v":"--"},{"$f":"IF(C58<>\"\",IFERROR(IF(SEARCH($C58,URLs!L58,1),\"ok\"),\"Palavra-chave não encontrada na imagem\"),\"--\")","v":"--"},{"$f":"IF(C58<>\"\",IF(URLs!H58=\"\",\"Descrição não preeenchida\",\"ok\"),\"--\")","v":"--"}]
[55,{"$f":"IFERROR(IF(VLOOKUP($A59,URLs!B$5:J$104,3,)<>0,VLOOKUP($A59,URLs!B$5:J$104,3,),\"\"),\"\")","v":""},{"$f":"IFERROR(IF(VLOOKUP($A59,URLs!B$5:J$104,9,)<>0,VLOOKUP($A59,URLs!B$5:J$104,9,),\"\"),\"\")","v":""},0,{"$f":"IF(C59<>\"\",IFERROR(IF(SEARCH($C59,URLs!E59,1),\"ok\"),\"Palavra-chave não encontrada no título\"),\"--\")","v":"--"},{"$f":"IF(C59<>\"\",IFERROR(IF(SEARCH(SUBSTITUTE(tiraAcento($C59),\" \",\"-\"),URLs!D59,1),\"ok\"),\"Palavra-chave não encontrada na URL\"),\"--\")","v":"--"},{"$f":"IF(C59<>\"\",IFERROR(IF(SEARCH($C59,URLs!K59,1),\"ok\"),\"Palavra-chave não encontrada no Título H1\"),\"--\")","v":"--"},{"$f":"IF(C59<>\"\",IFERROR(IF(SEARCH($C59,URLs!L59,1),\"ok\"),\"Palavra-chave não encontrada na imagem\"),\"--\")","v":"--"},{"$f":"IF(C59<>\"\",IF(URLs!H59=\"\",\"Descrição não preeenchida\",\"ok\"),\"--\")","v":"--"}]
[56,{"$f":"IFERROR(IF(VLOOKUP($A60,URLs!B$5:J$104,3,)<>0,VLOOKUP($A60,URLs!B$5:J$104,3,),\"\"),\"\")","v":""},{"$f":"IFERROR(IF(VLOOKUP($A60,URLs!B$5:J$104,9,)<>0,VLOOKUP($A60,URLs!B$5:J$104,9,),\"\"),\"\")","v":""},0,{"$f":"IF(C60<>\"\",IFERROR(IF(SEARCH($C60,URLs!E60,1),\"ok\"),\"Palavra-chave não encontrada no título\"),\"--\")","v":"--"},{"$f":"IF(C60<>\"\",IFERROR(IF(SEARCH(SUBSTITUTE(tiraAcento($C60),\" \",\"-\"),URLs!D60,1),\"ok\"),\"Palavra-chave não encontrada na URL\"),\"--\")","v":"--"},{"$f":"IF(C60<>\"\",IFERROR(IF(SEARCH($C60,URLs!K60,1),\"ok\"),\"Palavra-chave não encontrada no Título H1\"),\"--\")","v":"--"},{"$f":"IF(C60<>\"\",IFERROR(IF(SEARCH($C60,URLs!L60,1),\"ok\"),\"Palavra-chave não encontrada na imagem\"),\"--\")","v":"--"},{"$f":"IF(C60<>\"\",IF(URLs!H60=\"\",\"Descrição não preeenchida\",\"ok\"),\"--\")","v":"--"}]
[57,{"$f":"IFERROR(IF(VLOOKUP($A61,URLs!B$5:J$104,3,)<>0,VLOOKUP($A61,URLs!B$5:J$104,3,),\"\"),\"\")","v":""},{"$f":"IFERROR(IF(VLOOKUP($A61,URLs!B$5:J$104,9,)<>0,VLOOKUP($A61,URLs!B$5:J$104,9,),\"\"),\"\")","v":""},0,{"$f":"IF(C61<>\"\",IFERROR(IF(SEARCH($C61,URLs!E61,1),\"ok\"),\"Palavra-chave não encontrada no título\"),\"--\")","v":"--"},{"$f":"IF(C61<>\"\",IFERROR(IF(SEARCH(SUBSTITUTE(tiraAcento($C61),\" \",\"-\"),URLs!D61,1),\"ok\"),\"Palavra-chave não encontrada na URL\"),\"--\")","v":"--"},{"$f":"IF(C61<>\"\",IFERROR(IF(SEARCH($C61,URLs!K61,1),\"ok\"),\"Palavra-chave não encontrada no Título H1\"),\"--\")","v":"--"},{"$f":"IF(C61<>\"\",IFERROR(IF(SEARCH($C61,URLs!L61,1),\"ok\"),\"Palavra-chave não encontrada na imagem\"),\"--\")","v":"--"},{"$f":"IF(C61<>\"\",IF(URLs!H61=\"\",\"Descrição não preeenchida\",\"ok\"),\"--\")","v":"--"}]
[58,{"$f":"IFERROR(IF(VLOOKUP($A62,URLs!B$5:J$104,3,)<>0,VLOOKUP($A62,URLs!B$5:J$104,3,),\"\"),\"\")","v":""},{"$f":"IFERROR(IF(VLOOKUP($A62,URLs!B$5:J$104,9,)<>0,VLOOKUP($A62,URLs!B$5:J$104,9,),\"\"),\"\")","v":""},0,{"$f":"IF(C62<>\"\",IFERROR(IF(SEARCH($C62,URLs!E62,1),\"ok\"),\"Palavra-chave não encontrada no título\"),\"--\")","v":"--"},{"$f":"IF(C62<>\"\",IFERROR(IF(SEARCH(SUBSTITUTE(tiraAcento($C62),\" \",\"-\"),URLs!D62,1),\"ok\"),\"Palavra-chave não encontrada na URL\"),\"--\")","v":"--"},{"$f":"IF(C62<>\"\",IFERROR(IF(SEARCH($C62,URLs!K62,1),\"ok\"),\"Palavra-chave não encontrada no Título H1\"),\"--\")","v":"--"},{"$f":"IF(C62<>\"\",IFERROR(IF(SEARCH($C62,URLs!L62,1),\"ok\"),\"Palavra-chave não encontrada na imagem\"),\"--\")","v":"--"},{"$f":"IF(C62<>\"\",IF(URLs!H62=\"\",\"Descrição não preeenchida\",\"ok\"),\"--\")","v":"--"}]
[59,{"$f":"IFERROR(IF(VLOOKUP($A63,URLs!B$5:J$104,3,)<>0,VLOOKUP($A63,URLs!B$5:J$104,3,),\"\"),\"\")","v":""},{"$f":"IFERROR(IF(VLOOKUP($A63,URLs!B$5:J$104,9,)<>0,VLOOKUP($A63,URLs!B$5:J$104,9,),\"\"),\"\")","v":""},0,{"$f":"IF(C63<>\"\",IFERROR(IF(SEARCH($C63,URLs!E63,1),\"ok\"),\"Palavra-chave não encontrada no título\"),\"--\")","v":"--"},{"$f":"IF(C63<>\"\",IFERROR(IF(SEARCH(SUBSTITUTE(tiraAcento($C63),\" \",\"-\"),URLs!D63,1),\"ok\"),\"Palavra-chave não encontrada na URL\"),\"--\")","v":"--"},{"$f":"IF(C63<>\"\",IFERROR(IF(SEARCH($C63,URLs!K63,1),\"ok\"),\"Palavra-chave não encontrada no Título H1\"),\"--\")","v":"--"},{"$f":"IF(C63<>\"\",IFERROR(IF(SEARCH($C63,URLs!L63,1),\"ok\"),\"Palavra-chave não encontrada na imagem\"),\"--\")","v":"--"},{"$f":"IF(C63<>\"\",IF(URLs!H63=\"\",\"Descrição não preeenchida\",\"ok\"),\"--\")","v":"--"}]
[60,{"$f":"IFERROR(IF(VLOOKUP($A64,URLs!B$5:J$104,3,)<>0,VLOOKUP($A64,URLs!B$5:J$104,3,),\"\"),\"\")","v":""},{"$f":"IFERROR(IF(VLOOKUP($A64,URLs!B$5:J$104,9,)<>0,VLOOKUP($A64,URLs!B$5:J$104,9,),\"\"),\"\")","v":""},0,{"$f":"IF(C64<>\"\",IFERROR(IF(SEARCH($C64,URLs!E64,1),\"ok\"),\"Palavra-chave não encontrada no título\"),\"--\")","v":"--"},{"$f":"IF(C64<>\"\",IFERROR(IF(SEARCH(SUBSTITUTE(tiraAcento($C64),\" \",\"-\"),URLs!D64,1),\"ok\"),\"Palavra-chave não encontrada na URL\"),\"--\")","v":"--"},{"$f":"IF(C64<>\"\",IFERROR(IF(SEARCH($C64,URLs!K64,1),\"ok\"),\"Palavra-chave não encontrada no Título H1\"),\"--\")","v":"--"},{"$f":"IF(C64<>\"\",IFERROR(IF(SEARCH($C64,URLs!L64,1),\"ok\"),\"Palavra-chave não encontrada na imagem\"),\"--\")","v":"--"},{"$f":"IF(C64<>\"\",IF(URLs!H64=\"\",\"Descrição não preeenchida\",\"ok\"),\"--\")","v":"--"}]
[61,{"$f":"IFERROR(IF(VLOOKUP($A65,URLs!B$5:J$104,3,)<>0,VLOOKUP($A65,URLs!B$5:J$104,3,),\"\"),\"\")","v":""},{"$f":"IFERROR(IF(VLOOKUP($A65,URLs!B$5:J$104,9,)<>0,VLOOKUP($A65,URLs!B$5:J$104,9,),\"\"),\"\")","v":""},0,{"$f":"IF(C65<>\"\",IFERROR(IF(SEARCH($C65,URLs!E65,1),\"ok\"),\"Palavra-chave não encontrada no título\"),\"--\")","v":"--"},{"$f":"IF(C65<>\"\",IFERROR(IF(SEARCH(SUBSTITUTE(tiraAcento($C65),\" \",\"-\"),URLs!D65,1),\"ok\"),\"Palavra-chave não encontrada na URL\"),\"--\")","v":"--"},{"$f":"IF(C65<>\"\",IFERROR(IF(SEARCH($C65,URLs!K65,1),\"ok\"),\"Palavra-chave não encontrada no Título H1\"),\"--\")","v":"--"},{"$f":"IF(C65<>\"\",IFERROR(IF(SEARCH($C65,URLs!L65,1),\"ok\"),\"Palavra-chave não encontrada na imagem\"),\"--\")","v":"--"},{"$f":"IF(C65<>\"\",IF(URLs!H65=\"\",\"Descrição não preeenchida\",\"ok\"),\"--\")","v":"--"}]
[62,{"$f":"IFERROR(IF(VLOOKUP($A66,URLs!B$5:J$104,3,)<>0,VLOOKUP($A66,URLs!B$5:J$104,3,),\"\"),\"\")","v":""},{"$f":"IFERROR(IF(VLOOKUP($A66,URLs!B$5:J$104,9,)<>0,VLOOKUP($A66,URLs!B$5:J$104,9,),\"\"),\"\")","v":""},0,{"$f":"IF(C66<>\"\",IFERROR(IF(SEARCH($C66,URLs!E66,1),\"ok\"),\"Palavra-chave não encontrada no título\"),\"--\")","v":"--"},{"$f":"IF(C66<>\"\",IFERROR(IF(SEARCH(SUBSTITUTE(tiraAcento($C66),\" \",\"-\"),URLs!D66,1),\"ok\"),\"Palavra-chave não encontrada na URL\"),\"--\")","v":"--"},{"$f":"IF(C66<>\"\",IFERROR(IF(SEARCH($C66,URLs!K66,1),\"ok\"),\"Palavra-chave não encontrada no Título H1\"),\"--\")","v":"--"},{"$f":"IF(C66<>\"\",IFERROR(IF(SEARCH($C66,URLs!L66,1),\"ok\"),\"Palavra-chave não encontrada na imagem\"),\"--\")","v":"--"},{"$f":"IF(C66<>\"\",IF(URLs!H66=\"\",\"Descrição não preeenchida\",\"ok\"),\"--\")","v":"--"}]
[63,{"$f":"IFERROR(IF(VLOOKUP($A67,URLs!B$5:J$104,3,)<>0,VLOOKUP($A67,URLs!B$5:J$104,3,),\"\"),\"\")","v":""},{"$f":"IFERROR(IF(VLOOKUP($A67,URLs!B$5:J$104,9,)<>0,VLOOKUP($A67,URLs!B$5:J$104,9,),\"\"),\"\")","v":""},0,{"$f":"IF(C67<>\"\",IFERROR(IF(SEARCH($C67,URLs!E67,1),\"ok\"),\"Palavra-chave não encontrada no título\"),\"--\")","v":"--"},{"$f":"IF(C67<>\"\",IFERROR(IF(SEARCH(SUBSTITUTE(tiraAcento($C67),\" \",\"-\"),URLs!D67,1),\"ok\"),\"Palavra-chave não encontrada na URL\"),\"--\")","v":"--"},{"$f":"IF(C67<>\"\",IFERROR(IF(SEARCH($C67,URLs!K67,1),\"ok\"),\"Palavra-chave não encontrada no Título H1\"),\"--\")","v":"--"},{"$f":"IF(C67<>\"\",IFERROR(IF(SEARCH($C67,URLs!L67,1),\"ok\"),\"Palavra-chave não encontrada na imagem\"),\"--\")","v":"--"},{"$f":"IF(C67<>\"\",IF(URLs!H67=\"\",\"Descrição não preeenchida\",\"ok\"),\"--\")","v":"--"}]
[64,{"$f":"IFERROR(IF(VLOOKUP($A68,URLs!B$5:J$104,3,)<>0,VLOOKUP($A68,URLs!B$5:J$104,3,),\"\"),\"\")","v":""},{"$f":"IFERROR(IF(VLOOKUP($A68,URLs!B$5:J$104,9,)<>0,VLOOKUP($A68,URLs!B$5:J$104,9,),\"\"),\"\")","v":""},0,{"$f":"IF(C68<>\"\",IFERROR(IF(SEARCH($C68,URLs!E68,1),\"ok\"),\"Palavra-chave não encontrada no título\"),\"--\")","v":"--"},{"$f":"IF(C68<>\"\",IFERROR(IF(SEARCH(SUBSTITUTE(tiraAcento($C68),\" \",\"-\"),URLs!D68,1),\"ok\"),\"Palavra-chave não encontrada na URL\"),\"--\")","v":"--"},{"$f":"IF(C68<>\"\",IFERROR(IF(SEARCH($C68,URLs!K68,1),\"ok\"),\"Palavra-chave não encontrada no Título H1\"),\"--\")","v":"--"},{"$f":"IF(C68<>\"\",IFERROR(IF(SEARCH($C68,URLs!L68,1),\"ok\"),\"Palavra-chave não encontrada na imagem\"),\"--\")","v":"--"},{"$f":"IF(C68<>\"\",IF(URLs!H68=\"\",\"Descrição não preeenchida\",\"ok\"),\"--\")","v":"--"}]
[65,{"$f":"IFERROR(IF(VLOOKUP($A69,URLs!B$5:J$104,3,)<>0,VLOOKUP($A69,URLs!B$5:J$104,3,),\"\"),\"\")","v":""},{"$f":"IFERROR(IF(VLOOKUP($A69,URLs!B$5:J$104,9,)<>0,VLOOKUP($A69,URLs!B$5:J$104,9,),\"\"),\"\")","v":""},0,{"$f":"IF(C69<>\"\",IFERROR(IF(SEARCH($C69,URLs!E69,1),\"ok\"),\"Palavra-chave não encontrada no título\"),\"--\")","v":"--"},{"$f":"IF(C69<>\"\",IFERROR(IF(SEARCH(SUBSTITUTE(tiraAcento($C69),\" \",\"-\"),URLs!D69,1),\"ok\"),\"Palavra-chave não encontrada na URL\"),\"--\")","v":"--"},{"$f":"IF(C69<>\"\",IFERROR(IF(SEARCH($C69,URLs!K69,1),\"ok\"),\"Palavra-chave não encontrada no Título H1\"),\"--\")","v":"--"},{"$f":"IF(C69<>\"\",IFERROR(IF(SEARCH($C69,URLs!L69,1),\"ok\"),\"Palavra-chave não encontrada na imagem\"),\"--\")","v":"--"},{"$f":"IF(C69<>\"\",IF(URLs!H69=\"\",\"Descrição não preeenchida\",\"ok\"),\"--\")","v":"--"}]
[66,{"$f":"IFERROR(IF(VLOOKUP($A70,URLs!B$5:J$104,3,)<>0,VLOOKUP($A70,URLs!B$5:J$104,3,),\"\"),\"\")","v":""},{"$f":"IFERROR(IF(VLOOKUP($A70,URLs!B$5:J$104,9,)<>0,VLOOKUP($A70,URLs!B$5:J$104,9,),\"\"),\"\")","v":""},{"$f":"IF(C70=\"\",0%,COUNTIF(E70:I70,\"ok\")/COUNTA(E$4:I$4))","v":0},{"$f":"IF(C70<>\"\",IFERROR(IF(SEARCH($C70,URLs!E70,1),\"ok\"),\"Palavra-chave não encontrada no título\"),\"--\")","v":"--"},{"$f":"IF(C70<>\"\",IFERROR(IF(SEARCH(SUBSTITUTE(tiraAcento($C70),\" \",\"-\"),URLs!D70,1),\"ok\"),\"Palavra-chave não encontrada na URL\"),\"--\")","v":"--"},{"$f":"IF(C70<>\"\",IFERROR(IF(SEARCH($C70,URLs!K70,1),\"ok\"),\"Palavra-chave não encontrada no Título H1\"),\"--\")","v":"--"},{"$f":"IF(C70<>\"\",IFERROR(IF(SEARCH($C70,URLs!L70,1),\"ok\"),\"Palavra-chave não encontrada na imagem\"),\"--\")","v":"--"},{"$f":"IF(C70<>\"\",IF(URLs!H70=\"\",\"Descrição não preeenchida\",\"ok\"),\"--\")","v":"--"}]
[67,{"$f":"IFERROR(IF(VLOOKUP($A71,URLs!B$5:J$104,3,)<>0,VLOOKUP($A71,URLs!B$5:J$104,3,),\"\"),\"\")","v":""},{"$f":"IFERROR(IF(VLOOKUP($A71,URLs!B$5:J$104,9,)<>0,VLOOKUP($A71,URLs!B$5:J$104,9,),\"\"),\"\")","v":""},0,{"$f":"IF(C71<>\"\",IFERROR(IF(SEARCH($C71,URLs!E71,1),\"ok\"),\"Palavra-chave não encontrada no título\"),\"--\")","v":"--"},{"$f":"IF(C71<>\"\",IFERROR(IF(SEARCH(SUBSTITUTE(tiraAcento($C71),\" \",\"-\"),URLs!D71,1),\"ok\"),\"Palavra-chave não encontrada na URL\"),\"--\")","v":"--"},{"$f":"IF(C71<>\"\",IFERROR(IF(SEARCH($C71,URLs!K71,1),\"ok\"),\"Palavra-chave não encontrada no Título H1\"),\"--\")","v":"--"},{"$f":"IF(C71<>\"\",IFERROR(IF(SEARCH($C71,URLs!L71,1),\"ok\"),\"Palavra-chave não encontrada na imagem\"),\"--\")","v":"--"},{"$f":"IF(C71<>\"\",IF(URLs!H71=\"\",\"Descrição não preeenchida\",\"ok\"),\"--\")","v":"--"}]
[68,{"$f":"IFERROR(IF(VLOOKUP($A72,URLs!B$5:J$104,3,)<>0,VLOOKUP($A72,URLs!B$5:J$104,3,),\"\"),\"\")","v":""},{"$f":"IFERROR(IF(VLOOKUP($A72,URLs!B$5:J$104,9,)<>0,VLOOKUP($A72,URLs!B$5:J$104,9,),\"\"),\"\")","v":""},0,{"$f":"IF(C72<>\"\",IFERROR(IF(SEARCH($C72,URLs!E72,1),\"ok\"),\"Palavra-chave não encontrada no título\"),\"--\")","v":"--"},{"$f":"IF(C72<>\"\",IFERROR(IF(SEARCH(SUBSTITUTE(tiraAcento($C72),\" \",\"-\"),URLs!D72,1),\"ok\"),\"Palavra-chave não encontrada na URL\"),\"--\")","v":"--"},{"$f":"IF(C72<>\"\",IFERROR(IF(SEARCH($C72,URLs!K72,1),\"ok\"),\"Palavra-chave não encontrada no Título H1\"),\"--\")","v":"--"},{"$f":"IF(C72<>\"\",IFERROR(IF(SEARCH($C72,URLs!L72,1),\"ok\"),\"Palavra-chave não encontrada na imagem\"),\"--\")","v":"--"},{"$f":"IF(C72<>\"\",IF(URLs!H72=\"\",\"Descrição não preeenchida\",\"ok\"),\"--\")","v":"--"}]
[69,{"$f":"IFERROR(IF(VLOOKUP($A73,URLs!B$5:J$104,3,)<>0,VLOOKUP($A73,URLs!B$5:J$104,3,),\"\"),\"\")","v":""},{"$f":"IFERROR(IF(VLOOKUP($A73,URLs!B$5:J$104,9,)<>0,VLOOKUP($A73,URLs!B$5:J$104,9,),\"\"),\"\")","v":""},0,{"$f":"IF(C73<>\"\",IFERROR(IF(SEARCH($C73,URLs!E73,1),\"ok\"),\"Palavra-chave não encontrada no título\"),\"--\")","v":"--"},{"$f":"IF(C73<>\"\",IFERROR(IF(SEARCH(SUBSTITUTE(tiraAcento($C73),\" \",\"-\"),URLs!D73,1),\"ok\"),\"Palavra-chave não encontrada na URL\"),\"--\")","v":"--"},{"$f":"IF(C73<>\"\",IFERROR(IF(SEARCH($C73,URLs!K73,1),\"ok\"),\"Palavra-chave não encontrada no Título H1\"),\"--\")","v":"--"},{"$f":"IF(C73<>\"\",IFERROR(IF(SEARCH($C73,URLs!L73,1),\"ok\"),\"Palavra-chave não encontrada na imagem\"),\"--\")","v":"--"},{"$f":"IF(C73<>\"\",IF(URLs!H73=\"\",\"Descrição não preeenchida\",\"ok\"),\"--\")","v":"--"}]
[70,{"$f":"IFERROR(IF(VLOOKUP($A74,URLs!B$5:J$104,3,)<>0,VLOOKUP($A74,URLs!B$5:J$104,3,),\"\"),\"\")","v":""},{"$f":"IFERROR(IF(VLOOKUP($A74,URLs!B$5:J$104,9,)<>0,VLOOKUP($A74,URLs!B$5:J$104,9,),\"\"),\"\")","v":""},0,{"$f":"IF(C74<>\"\",IFERROR(IF(SEARCH($C74,URLs!E74,1),\"ok\"),\"Palavra-chave não encontrada no título\"),\"--\")","v":"--"},{"$f":"IF(C74<>\"\",IFERROR(IF(SEARCH(SUBSTITUTE(tiraAcento($C74),\" \",\"-\"),URLs!D74,1),\"ok\"),\"Palavra-chave não encontrada na URL\"),\"--\")","v":"--"},{"$f":"IF(C74<>\"\",IFERROR(IF(SEARCH($C74,URLs!K74,1),\"ok\"),\"Palavra-chave não encontrada no Título H1\"),\"--\")","v":"--"},{"$f":"IF(C74<>\"\",IFERROR(IF(SEARCH($C74,URLs!L74,1),\"ok\"),\"Palavra-chave não encontrada na imagem\"),\"--\")","v":"--"},{"$f":"IF(C74<>\"\",IF(URLs!H74=\"\",\"Descrição não preeenchida\",\"ok\"),\"--\")","v":"--"}]
[71,{"$f":"IFERROR(IF(VLOOKUP($A75,URLs!B$5:J$104,3,)<>0,VLOOKUP($A75,URLs!B$5:J$104,3,),\"\"),\"\")","v":""},{"$f":"IFERROR(IF(VLOOKUP($A75,URLs!B$5:J$104,9,)<>0,VLOOKUP($A75,URLs!B$5:J$104,9,),\"\"),\"\")","v":""},0,{"$f":"IF(C75<>\"\",IFERROR(IF(SEARCH($C75,URLs!E75,1),\"ok\"),\"Palavra-chave não encontrada no título\"),\"--\")","v":"--"},{"$f":"IF(C75<>\"\",IFERROR(IF(SEARCH(SUBSTITUTE(tiraAcento($C75),\" \",\"-\"),URLs!D75,1),\"ok\"),\"Palavra-chave não encontrada na URL\"),\"--\")","v":"--"},{"$f":"IF(C75<>\"\",IFERROR(IF(SEARCH($C75,URLs!K75,1),\"ok\"),\"Palavra-chave não encontrada no Título H1\"),\"--\")","v":"--"},{"$f":"IF(C75<>\"\",IFERROR(IF(SEARCH($C75,URLs!L75,1),\"ok\"),\"Palavra-chave não encontrada na imagem\"),\"--\")","v":"--"},{"$f":"IF(C75<>\"\",IF(URLs!H75=\"\",\"Descrição não preeenchida\",\"ok\"),\"--\")","v":"--"}]
[72,{"$f":"IFERROR(IF(VLOOKUP($A76,URLs!B$5:J$104,3,)<>0,VLOOKUP($A76,URLs!B$5:J$104,3,),\"\"),\"\")","v":""},{"$f":"IFERROR(IF(VLOOKUP($A76,URLs!B$5:J$104,9,)<>0,VLOOKUP($A76,URLs!B$5:J$104,9,),\"\"),\"\")","v":""},0,{"$f":"IF(C76<>\"\",IFERROR(IF(SEARCH($C76,URLs!E76,1),\"ok\"),\"Palavra-chave não encontrada no título\"),\"--\")","v":"--"},{"$f":"IF(C76<>\"\",IFERROR(IF(SEARCH(SUBSTITUTE(tiraAcento($C76),\" \",\"-\"),URLs!D76,1),\"ok\"),\"Palavra-chave não encontrada na URL\"),\"--\")","v":"--"},{"$f":"IF(C76<>\"\",IFERROR(IF(SEARCH($C76,URLs!K76,1),\"ok\"),\"Palavra-chave não encontrada no Título H1\"),\"--\")","v":"--"},{"$f":"IF(C76<>\"\",IFERROR(IF(SEARCH($C76,URLs!L76,1),\"ok\"),\"Palavra-chave não encontrada na imagem\"),\"--\")","v":"--"},{"$f":"IF(C76<>\"\",IF(URLs!H76=\"\",\"Descrição não preeenchida\",\"ok\"),\"--\")","v":"--"}]
[73,{"$f":"IFERROR(IF(VLOOKUP($A77,URLs!B$5:J$104,3,)<>0,VLOOKUP($A77,URLs!B$5:J$104,3,),\"\"),\"\")","v":""},{"$f":"IFERROR(IF(VLOOKUP($A77,URLs!B$5:J$104,9,)<>0,VLOOKUP($A77,URLs!B$5:J$104,9,),\"\"),\"\")","v":""},0,{"$f":"IF(C77<>\"\",IFERROR(IF(SEARCH($C77,URLs!E77,1),\"ok\"),\"Palavra-chave não encontrada no título\"),\"--\")","v":"--"},{"$f":"IF(C77<>\"\",IFERROR(IF(SEARCH(SUBSTITUTE(tiraAcento($C77),\" \",\"-\"),URLs!D77,1),\"ok\"),\"Palavra-chave não encontrada na URL\"),\"--\")","v":"--"},{"$f":"IF(C77<>\"\",IFERROR(IF(SEARCH($C77,URLs!K77,1),\"ok\"),\"Palavra-chave não encontrada no Título H1\"),\"--\")","v":"--"},{"$f":"IF(C77<>\"\",IFERROR(IF(SEARCH($C77,URLs!L77,1),\"ok\"),\"Palavra-chave não encontrada na imagem\"),\"--\")","v":"--"},{"$f":"IF(C77<>\"\",IF(URLs!H77=\"\",\"Descrição não preeenchida\",\"ok\"),\"--\")","v":"--"}]
[74,{"$f":"IFERROR(IF(VLOOKUP($A78,URLs!B$5:J$104,3,)<>0,VLOOKUP($A78,URLs!B$5:J$104,3,),\"\"),\"\")","v":""},{"$f":"IFERROR(IF(VLOOKUP($A78,URLs!B$5:J$104,9,)<>0,VLOOKUP($A78,URLs!B$5:J$104,9,),\"\"),\"\")","v":""},0,{"$f":"IF(C78<>\"\",IFERROR(IF(SEARCH($C78,URLs!E78,1),\"ok\"),\"Palavra-chave não encontrada no título\"),\"--\")","v":"--"},{"$f":"IF(C78<>\"\",IFERROR(IF(SEARCH(SUBSTITUTE(tiraAcento($C78),\" \",\"-\"),URLs!D78,1),\"ok\"),\"Palavra-chave não encontrada na URL\"),\"--\")","v":"--"},{"$f":"IF(C78<>\"\",IFERROR(IF(SEARCH($C78,URLs!K78,1),\"ok\"),\"Palavra-chave não encontrada no Título H1\"),\"--\")","v":"--"},{"$f":"IF(C78<>\"\",IFERROR(IF(SEARCH($C78,URLs!L78,1),\"ok\"),\"Palavra-chave não encontrada na imagem\"),\"--\")","v":"--"},{"$f":"IF(C78<>\"\",IF(URLs!H78=\"\",\"Descrição não preeenchida\",\"ok\"),\"--\")","v":"--"}]
[75,{"$f":"IFERROR(IF(VLOOKUP($A79,URLs!B$5:J$104,3,)<>0,VLOOKUP($A79,URLs!B$5:J$104,3,),\"\"),\"\")","v":""},{"$f":"IFERROR(IF(VLOOKUP($A79,URLs!B$5:J$104,9,)<>0,VLOOKUP($A79,URLs!B$5:J$104,9,),\"\"),\"\")","v":""},0,{"$f":"IF(C79<>\"\",IFERROR(IF(SEARCH($C79,URLs!E79,1),\"ok\"),\"Palavra-chave não encontrada no título\"),\"--\")","v":"--"},{"$f":"IF(C79<>\"\",IFERROR(IF(SEARCH(SUBSTITUTE(tiraAcento($C79),\" \",\"-\"),URLs!D79,1),\"ok\"),\"Palavra-chave não encontrada na URL\"),\"--\")","v":"--"},{"$f":"IF(C79<>\"\",IFERROR(IF(SEARCH($C79,URLs!K79,1),\"ok\"),\"Palavra-chave não encontrada no Título H1\"),\"--\")","v":"--"},{"$f":"IF(C79<>\"\",IFERROR(IF(SEARCH($C79,URLs!L79,1),\"ok\"),\"Palavra-chave não encontrada na imagem\"),\"--\")","v":"--"},{"$f":"IF(C79<>\"\",IF(URLs!H79=\"\",\"Descrição não preeenchida\",\"ok\"),\"--\")","v":"--"}]
[76,{"$f":"IFERROR(IF(VLOOKUP($A80,URLs!B$5:J$104,3,)<>0,VLOOKUP($A80,URLs!B$5:J$104,3,),\"\"),\"\")","v":""},{"$f":"IFERROR(IF(VLOOKUP($A80,URLs!B$5:J$104,9,)<>0,VLOOKUP($A80,URLs!B$5:J$104,9,),\"\"),\"\")","v":""},0,{"$f":"IF(C80<>\"\",IFERROR(IF(SEARCH($C80,URLs!E80,1),\"ok\"),\"Palavra-chave não encontrada no título\"),\"--\")","v":"--"},{"$f":"IF(C80<>\"\",IFERROR(IF(SEARCH(SUBSTITUTE(tiraAcento($C80),\" \",\"-\"),URLs!D80,1),\"ok\"),\"Palavra-chave não encontrada na URL\"),\"--\")","v":"--"},{"$f":"IF(C80<>\"\",IFERROR(IF(SEARCH($C80,URLs!K80,1),\"ok\"),\"Palavra-chave não encontrada no Título H1\"),\"--\")","v":"--"},{"$f":"IF(C80<>\"\",IFERROR(IF(SEARCH($C80,URLs!L80,1),\"ok\"),\"Palavra-chave não encontrada na imagem\"),\"--\")","v":"--"},{"$f":"IF(C80<>\"\",IF(URLs!H80=\"\",\"Descrição não preeenchida\",\"ok\"),\"--\")","v":"--"}]
[77,{"$f":"IFERROR(IF(VLOOKUP($A81,URLs!B$5:J$104,3,)<>0,VLOOKUP($A81,URLs!B$5:J$104,3,),\"\"),\"\")","v":""},{"$f":"IFERROR(IF(VLOOKUP($A81,URLs!B$5:J$104,9,)<>0,VLOOKUP($A81,URLs!B$5:J$104,9,),\"\"),\"\")","v":""},0,{"$f":"IF(C81<>\"\",IFERROR(IF(SEARCH($C81,URLs!E81,1),\"ok\"),\"Palavra-chave não encontrada no título\"),\"--\")","v":"--"},{"$f":"IF(C81<>\"\",IFERROR(IF(SEARCH(SUBSTITUTE(tiraAcento($C81),\" \",\"-\"),URLs!D81,1),\"ok\"),\"Palavra-chave não encontrada na URL\"),\"--\")","v":"--"},{"$f":"IF(C81<>\"\",IFERROR(IF(SEARCH($C81,URLs!K81,1),\"ok\"),\"Palavra-chave não encontrada no Título H1\"),\"--\")","v":"--"},{"$f":"IF(C81<>\"\",IFERROR(IF(SEARCH($C81,URLs!L81,1),\"ok\"),\"Palavra-chave não encontrada na imagem\"),\"--\")","v":"--"},{"$f":"IF(C81<>\"\",IF(URLs!H81=\"\",\"Descrição não preeenchida\",\"ok\"),\"--\")","v":"--"}]
[78,{"$f":"IFERROR(IF(VLOOKUP($A82,URLs!B$5:J$104,3,)<>0,VLOOKUP($A82,URLs!B$5:J$104,3,),\"\"),\"\")","v":""},{"$f":"IFERROR(IF(VLOOKUP($A82,URLs!B$5:J$104,9,)<>0,VLOOKUP($A82,URLs!B$5:J$104,9,),\"\"),\"\")","v":""},0,{"$f":"IF(C82<>\"\",IFERROR(IF(SEARCH($C82,URLs!E82,1),\"ok\"),\"Palavra-chave não encontrada no título\"),\"--\")","v":"--"},{"$f":"IF(C82<>\"\",IFERROR(IF(SEARCH(SUBSTITUTE(tiraAcento($C82),\" \",\"-\"),URLs!D82,1),\"ok\"),\"Palavra-chave não encontrada na URL\"),\"--\")","v":"--"},{"$f":"IF(C82<>\"\",IFERROR(IF(SEARCH($C82,URLs!K82,1),\"ok\"),\"Palavra-chave não encontrada no Título H1\"),\"--\")","v":"--"},{"$f":"IF(C82<>\"\",IFERROR(IF(SEARCH($C82,URLs!L82,1),\"ok\"),\"Palavra-chave não encontrada na imagem\"),\"--\")","v":"--"},{"$f":"IF(C82<>\"\",IF(URLs!H82=\"\",\"Descrição não preeenchida\",\"ok\"),\"--\")","v":"--"}]
[79,{"$f":"IFERROR(IF(VLOOKUP($A83,URLs!B$5:J$104,3,)<>0,VLOOKUP($A83,URLs!B$5:J$104,3,),\"\"),\"\")","v":""},{"$f":"IFERROR(IF(VLOOKUP($A83,URLs!B$5:J$104,9,)<>0,VLOOKUP($A83,URLs!B$5:J$104,9,),\"\"),\"\")","v":""},0,{"$f":"IF(C83<>\"\",IFERROR(IF(SEARCH($C83,URLs!E83,1),\"ok\"),\"Palavra-chave não encontrada no título\"),\"--\")","v":"--"},{"$f":"IF(C83<>\"\",IFERROR(IF(SEARCH(SUBSTITUTE(tiraAcento($C83),\" \",\"-\"),URLs!D83,1),\"ok\"),\"Palavra-chave não encontrada na URL\"),\"--\")","v":"--"},{"$f":"IF(C83<>\"\",IFERROR(IF(SEARCH($C83,URLs!K83,1),\"ok\"),\"Palavra-chave não encontrada no Título H1\"),\"--\")","v":"--"},{"$f":"IF(C83<>\"\",IFERROR(IF(SEARCH($C83,URLs!L83,1),\"ok\"),\"Palavra-chave não encontrada na imagem\"),\"--\")","v":"--"},{"$f":"IF(C83<>\"\",IF(URLs!H83=\"\",\"Descrição não preeenchida\",\"ok\"),\"--\")","v":"--"}]
[80,{"$f":"IFERROR(IF(VLOOKUP($A84,URLs!B$5:J$104,3,)<>0,VLOOKUP($A84,URLs!B$5:J$104,3,),\"\"),\"\")","v":""},{"$f":"IFERROR(IF(VLOOKUP($A84,URLs!B$5:J$104,9,)<>0,VLOOKUP($A84,URLs!B$5:J$104,9,),\"\"),\"\")","v":""},0,{"$f":"IF(C84<>\"\",IFERROR(IF(SEARCH($C84,URLs!E84,1),\"ok\"),\"Palavra-chave não encontrada no título\"),\"--\")","v":"--"},{"$f":"IF(C84<>\"\",IFERROR(IF(SEARCH(SUBSTITUTE(tiraAcento($C84),\" \",\"-\"),URLs!D84,1),\"ok\"),\"Palavra-chave não encontrada na URL\"),\"--\")","v":"--"},{"$f":"IF(C84<>\"\",IFERROR(IF(SEARCH($C84,URLs!K84,1),\"ok\"),\"Palavra-chave não encontrada no Título H1\"),\"--\")","v":"--"},{"$f":"IF(C84<>\"\",IFERROR(IF(SEARCH($C84,URLs!L84,1),\"ok\"),\"Palavra-chave não encontrada na imagem\"),\"--\")","v":"--"},{"$f":"IF(C84<>\"\",IF(URLs!H84=\"\",\"Descrição não preeenchida\",\"ok\"),\"--\")","v":"--"}]
[81,{"$f":"IFERROR(IF(VLOOKUP($A85,URLs!B$5:J$104,3,)<>0,VLOOKUP($A85,URLs!B$5:J$104,3,),\"\"),\"\")","v":""},{"$f":"IFERROR(IF(VLOOKUP($A85,URLs!B$5:J$104,9,)<>0,VLOOKUP($A85,URLs!B$5:J$104,9,),\"\"),\"\")","v":""},0,{"$f":"IF(C85<>\"\",IFERROR(IF(SEARCH($C85,URLs!E85,1),\"ok\"),\"Palavra-chave não encontrada no título\"),\"--\")","v":"--"},{"$f":"IF(C85<>\"\",IFERROR(IF(SEARCH(SUBSTITUTE(tiraAcento($C85),\" \",\"-\"),URLs!D85,1),\"ok\"),\"Palavra-chave não encontrada na URL\"),\"--\")","v":"--"},{"$f":"IF(C85<>\"\",IFERROR(IF(SEARCH($C85,URLs!K85,1),\"ok\"),\"Palavra-chave não encontrada no Título H1\"),\"--\")","v":"--"},{"$f":"IF(C85<>\"\",IFERROR(IF(SEARCH($C85,URLs!L85,1),\"ok\"),\"Palavra-chave não encontrada na imagem\"),\"--\")","v":"--"},{"$f":"IF(C85<>\"\",IF(URLs!H85=\"\",\"Descrição não preeenchida\",\"ok\"),\"--\")","v":"--"}]
[82,{"$f":"IFERROR(IF(VLOOKUP($A86,URLs!B$5:J$104,3,)<>0,VLOOKUP($A86,URLs!B$5:J$104,3,),\"\"),\"\")","v":""},{"$f":"IFERROR(IF(VLOOKUP($A86,URLs!B$5:J$104,9,)<>0,VLOOKUP($A86,URLs!B$5:J$104,9,),\"\"),\"\")","v":""},0,{"$f":"IF(C86<>\"\",IFERROR(IF(SEARCH($C86,URLs!E86,1),\"ok\"),\"Palavra-chave não encontrada no título\"),\"--\")","v":"--"},{"$f":"IF(C86<>\"\",IFERROR(IF(SEARCH(SUBSTITUTE(tiraAcento($C86),\" \",\"-\"),URLs!D86,1),\"ok\"),\"Palavra-chave não encontrada na URL\"),\"--\")","v":"--"},{"$f":"IF(C86<>\"\",IFERROR(IF(SEARCH($C86,URLs!K86,1),\"ok\"),\"Palavra-chave não encontrada no Título H1\"),\"--\")","v":"--"},{"$f":"IF(C86<>\"\",IFERROR(IF(SEARCH($C86,URLs!L86,1),\"ok\"),\"Palavra-chave não encontrada na imagem\"),\"--\")","v":"--"},{"$f":"IF(C86<>\"\",IF(URLs!H86=\"\",\"Descrição não preeenchida\",\"ok\"),\"--\")","v":"--"}]
[83,{"$f":"IFERROR(IF(VLOOKUP($A87,URLs!B$5:J$104,3,)<>0,VLOOKUP($A87,URLs!B$5:J$104,3,),\"\"),\"\")","v":""},{"$f":"IFERROR(IF(VLOOKUP($A87,URLs!B$5:J$104,9,)<>0,VLOOKUP($A87,URLs!B$5:J$104,9,),\"\"),\"\")","v":""},0,{"$f":"IF(C87<>\"\",IFERROR(IF(SEARCH($C87,URLs!E87,1),\"ok\"),\"Palavra-chave não encontrada no título\"),\"--\")","v":"--"},{"$f":"IF(C87<>\"\",IFERROR(IF(SEARCH(SUBSTITUTE(tiraAcento($C87),\" \",\"-\"),URLs!D87,1),\"ok\"),\"Palavra-chave não encontrada na URL\"),\"--\")","v":"--"},{"$f":"IF(C87<>\"\",IFERROR(IF(SEARCH($C87,URLs!K87,1),\"ok\"),\"Palavra-chave não encontrada no Título H1\"),\"--\")","v":"--"},{"$f":"IF(C87<>\"\",IFERROR(IF(SEARCH($C87,URLs!L87,1),\"ok\"),\"Palavra-chave não encontrada na imagem\"),\"--\")","v":"--"},{"$f":"IF(C87<>\"\",IF(URLs!H87=\"\",\"Descrição não preeenchida\",\"ok\"),\"--\")","v":"--"}]
[84,{"$f":"IFERROR(IF(VLOOKUP($A88,URLs!B$5:J$104,3,)<>0,VLOOKUP($A88,URLs!B$5:J$104,3,),\"\"),\"\")","v":""},{"$f":"IFERROR(IF(VLOOKUP($A88,URLs!B$5:J$104,9,)<>0,VLOOKUP($A88,URLs!B$5:J$104,9,),\"\"),\"\")","v":""},0,{"$f":"IF(C88<>\"\",IFERROR(IF(SEARCH($C88,URLs!E88,1),\"ok\"),\"Palavra-chave não encontrada no título\"),\"--\")","v":"--"},{"$f":"IF(C88<>\"\",IFERROR(IF(SEARCH(SUBSTITUTE(tiraAcento($C88),\" \",\"-\"),URLs!D88,1),\"ok\"),\"Palavra-chave não encontrada na URL\"),\"--\")","v":"--"},{"$f":"IF(C88<>\"\",IFERROR(IF(SEARCH($C88,URLs!K88,1),\"ok\"),\"Palavra-chave não encontrada no Título H1\"),\"--\")","v":"--"},{"$f":"IF(C88<>\"\",IFERROR(IF(SEARCH($C88,URLs!L88,1),\"ok\"),\"Palavra-chave não encontrada na imagem\"),\"--\")","v":"--"},{"$f":"IF(C88<>\"\",IF(URLs!H88=\"\",\"Descrição não preeenchida\",\"ok\"),\"--\")","v":"--"}]
[85,{"$f":"IFERROR(IF(VLOOKUP($A89,URLs!B$5:J$104,3,)<>0,VLOOKUP($A89,URLs!B$5:J$104,3,),\"\"),\"\")","v":""},{"$f":"IFERROR(IF(VLOOKUP($A89,URLs!B$5:J$104,9,)<>0,VLOOKUP($A89,URLs!B$5:J$104,9,),\"\"),\"\")","v":""},0,{"$f":"IF(C89<>\"\",IFERROR(IF(SEARCH($C89,URLs!E89,1),\"ok\"),\"Palavra-chave não encontrada no título\"),\"--\")","v":"--"},{"$f":"IF(C89<>\"\",IFERROR(IF(SEARCH(SUBSTITUTE(tiraAcento($C89),\" \",\"-\"),URLs!D89,1),\"ok\"),\"Palavra-chave não encontrada na URL\"),\"--\")","v":"--"},{"$f":"IF(C89<>\"\",IFERROR(IF(SEARCH($C89,URLs!K89,1),\"ok\"),\"Palavra-chave não encontrada no Título H1\"),\"--\")","v":"--"},{"$f":"IF(C89<>\"\",IFERROR(IF(SEARCH($C89,URLs!L89,1),\"ok\"),\"Palavra-chave não encontrada na imagem\"),\"--\")","v":"--"},{"$f":"IF(C89<>\"\",IF(URLs!H89=\"\",\"Descrição não preeenchida\",\"ok\"),\"--\")","v":"--"}]
[86,{"$f":"IFERROR(IF(VLOOKUP($A90,URLs!B$5:J$104,3,)<>0,VLOOKUP($A90,URLs!B$5:J$104,3,),\"\"),\"\")","v":""},{"$f":"IFERROR(IF(VLOOKUP($A90,URLs!B$5:J$104,9,)<>0,VLOOKUP($A90,URLs!B$5:J$104,9,),\"\"),\"\")","v":""},0,{"$f":"IF(C90<>\"\",IFERROR(IF(SEARCH($C90,URLs!E90,1),\"ok\"),\"Palavra-chave não encontrada no título\"),\"--\")","v":"--"},{"$f":"IF(C90<>\"\",IFERROR(IF(SEARCH(SUBSTITUTE(tiraAcento($C90),\" \",\"-\"),URLs!D90,1),\"ok\"),\"Palavra-chave não encontrada na URL\"),\"--\")","v":"--"},{"$f":"IF(C90<>\"\",IFERROR(IF(SEARCH($C90,URLs!K90,1),\"ok\"),\"Palavra-chave não encontrada no Título H1\"),\"--\")","v":"--"},{"$f":"IF(C90<>\"\",IFERROR(IF(SEARCH($C90,URLs!L90,1),\"ok\"),\"Palavra-chave não encontrada na imagem\"),\"--\")","v":"--"},{"$f":"IF(C90<>\"\",IF(URLs!H90=\"\",\"Descrição não preeenchida\",\"ok\"),\"--\")","v":"--"}]
[87,{"$f":"IFERROR(IF(VLOOKUP($A91,URLs!B$5:J$104,3,)<>0,VLOOKUP($A91,URLs!B$5:J$104,3,),\"\"),\"\")","v":""},{"$f":"IFERROR(IF(VLOOKUP($A91,URLs!B$5:J$104,9,)<>0,VLOOKUP($A91,URLs!B$5:J$104,9,),\"\"),\"\")","v":""},0,{"$f":"IF(C91<>\"\",IFERROR(IF(SEARCH($C91,URLs!E91,1),\"ok\"),\"Palavra-chave não encontrada no título\"),\"--\")","v":"--"},{"$f":"IF(C91<>\"\",IFERROR(IF(SEARCH(SUBSTITUTE(tiraAcento($C91),\" \",\"-\"),URLs!D91,1),\"ok\"),\"Palavra-chave não encontrada na URL\"),\"--\")","v":"--"},{"$f":"IF(C91<>\"\",IFERROR(IF(SEARCH($C91,URLs!K91,1),\"ok\"),\"Palavra-chave não encontrada no Título H1\"),\"--\")","v":"--"},{"$f":"IF(C91<>\"\",IFERROR(IF(SEARCH($C91,URLs!L91,1),\"ok\"),\"Palavra-chave não encontrada na imagem\"),\"--\")","v":"--"},{"$f":"IF(C91<>\"\",IF(URLs!H91=\"\",\"Descrição não preeenchida\",\"ok\"),\"--\")","v":"--"}]
[88,{"$f":"IFERROR(IF(VLOOKUP($A92,URLs!B$5:J$104,3,)<>0,VLOOKUP($A92,URLs!B$5:J$104,3,),\"\"),\"\")","v":""},{"$f":"IFERROR(IF(VLOOKUP($A92,URLs!B$5:J$104,9,)<>0,VLOOKUP($A92,URLs!B$5:J$104,9,),\"\"),\"\")","v":""},0,{"$f":"IF(C92<>\"\",IFERROR(IF(SEARCH($C92,URLs!E92,1),\"ok\"),\"Palavra-chave não encontrada no título\"),\"--\")","v":"--"},{"$f":"IF(C92<>\"\",IFERROR(IF(SEARCH(SUBSTITUTE(tiraAcento($C92),\" \",\"-\"),URLs!D92,1),\"ok\"),\"Palavra-chave não encontrada na URL\"),\"--\")","v":"--"},{"$f":"IF(C92<>\"\",IFERROR(IF(SEARCH($C92,URLs!K92,1),\"ok\"),\"Palavra-chave não encontrada no Título H1\"),\"--\")","v":"--"},{"$f":"IF(C92<>\"\",IFERROR(IF(SEARCH($C92,URLs!L92,1),\"ok\"),\"Palavra-chave não encontrada na imagem\"),\"--\")","v":"--"},{"$f":"IF(C92<>\"\",IF(URLs!H92=\"\",\"Descrição não preeenchida\",\"ok\"),\"--\")","v":"--"}]
[89,{"$f":"IFERROR(IF(VLOOKUP($A93,URLs!B$5:J$104,3,)<>0,VLOOKUP($A93,URLs!B$5:J$104,3,),\"\"),\"\")","v":""},{"$f":"IFERROR(IF(VLOOKUP($A93,URLs!B$5:J$104,9,)<>0,VLOOKUP($A93,URLs!B$5:J$104,9,),\"\"),\"\")","v":""},0,{"$f":"IF(C93<>\"\",IFERROR(IF(SEARCH($C93,URLs!E93,1),\"ok\"),\"Palavra-chave não encontrada no título\"),\"--\")","v":"--"},{"$f":"IF(C93<>\"\",IFERROR(IF(SEARCH(SUBSTITUTE(tiraAcento($C93),\" \",\"-\"),URLs!D93,1),\"ok\"),\"Palavra-chave não encontrada na URL\"),\"--\")","v":"--"},{"$f":"IF(C93<>\"\",IFERROR(IF(SEARCH($C93,URLs!K93,1),\"ok\"),\"Palavra-chave não encontrada no Título H1\"),\"--\")","v":"--"},{"$f":"IF(C93<>\"\",IFERROR(IF(SEARCH($C93,URLs!L93,1),\"ok\"),\"Palavra-chave não encontrada na imagem\"),\"--\")","v":"--"},{"$f":"IF(C93<>\"\",IF(URLs!H93=\"\",\"Descrição não preeenchida\",\"ok\"),\"--\")","v":"--"}]
[90,{"$f":"IFERROR(IF(VLOOKUP($A94,URLs!B$5:J$104,3,)<>0,VLOOKUP($A94,URLs!B$5:J$104,3,),\"\"),\"\")","v":""},{"$f":"IFERROR(IF(VLOOKUP($A94,URLs!B$5:J$104,9,)<>0,VLOOKUP($A94,URLs!B$5:J$104,9,),\"\"),\"\")","v":""},0,{"$f":"IF(C94<>\"\",IFERROR(IF(SEARCH($C94,URLs!E94,1),\"ok\"),\"Palavra-chave não encontrada no título\"),\"--\")","v":"--"},{"$f":"IF(C94<>\"\",IFERROR(IF(SEARCH(SUBSTITUTE(tiraAcento($C94),\" \",\"-\"),URLs!D94,1),\"ok\"),\"Palavra-chave não encontrada na URL\"),\"--\")","v":"--"},{"$f":"IF(C94<>\"\",IFERROR(IF(SEARCH($C94,URLs!K94,1),\"ok\"),\"Palavra-chave não encontrada no Título H1\"),\"--\")","v":"--"},{"$f":"IF(C94<>\"\",IFERROR(IF(SEARCH($C94,URLs!L94,1),\"ok\"),\"Palavra-chave não encontrada na imagem\"),\"--\")","v":"--"},{"$f":"IF(C94<>\"\",IF(URLs!H94=\"\",\"Descrição não preeenchida\",\"ok\"),\"--\")","v":"--"}]
[91,{"$f":"IFERROR(IF(VLOOKUP($A95,URLs!B$5:J$104,3,)<>0,VLOOKUP($A95,URLs!B$5:J$104,3,),\"\"),\"\")","v":""},{"$f":"IFERROR(IF(VLOOKUP($A95,URLs!B$5:J$104,9,)<>0,VLOOKUP($A95,URLs!B$5:J$104,9,),\"\"),\"\")","v":""},0,{"$f":"IF(C95<>\"\",IFERROR(IF(SEARCH($C95,URLs!E95,1),\"ok\"),\"Palavra-chave não encontrada no título\"),\"--\")","v":"--"},{"$f":"IF(C95<>\"\",IFERROR(IF(SEARCH(SUBSTITUTE(tiraAcento($C95),\" \",\"-\"),URLs!D95,1),\"ok\"),\"Palavra-chave não encontrada na URL\"),\"--\")","v":"--"},{"$f":"IF(C95<>\"\",IFERROR(IF(SEARCH($C95,URLs!K95,1),\"ok\"),\"Palavra-chave não encontrada no Título H1\"),\"--\")","v":"--"},{"$f":"IF(C95<>\"\",IFERROR(IF(SEARCH($C95,URLs!L95,1),\"ok\"),\"Palavra-chave não encontrada na imagem\"),\"--\")","v":"--"},{"$f":"IF(C95<>\"\",IF(URLs!H95=\"\",\"Descrição não preeenchida\",\"ok\"),\"--\")","v":"--"}]
[92,{"$f":"IFERROR(IF(VLOOKUP($A96,URLs!B$5:J$104,3,)<>0,VLOOKUP($A96,URLs!B$5:J$104,3,),\"\"),\"\")","v":""},{"$f":"IFERROR(IF(VLOOKUP($A96,URLs!B$5:J$104,9,)<>0,VLOOKUP($A96,URLs!B$5:J$104,9,),\"\"),\"\")","v":""},0,{"$f":"IF(C96<>\"\",IFERROR(IF(SEARCH($C96,URLs!E96,1),\"ok\"),\"Palavra-chave não encontrada no título\"),\"--\")","v":"--"},{"$f":"IF(C96<>\"\",IFERROR(IF(SEARCH(SUBSTITUTE(tiraAcento($C96),\" \",\"-\"),URLs!D96,1),\"ok\"),\"Palavra-chave não encontrada na URL\"),\"--\")","v":"--"},{"$f":"IF(C96<>\"\",IFERROR(IF(SEARCH($C96,URLs!K96,1),\"ok\"),\"Palavra-chave não encontrada no Título H1\"),\"--\")","v":"--"},{"$f":"IF(C96<>\"\",IFERROR(IF(SEARCH($C96,URLs!L96,1),\"ok\"),\"Palavra-chave não encontrada na imagem\"),\"--\")","v":"--"},{"$f":"IF(C96<>\"\",IF(URLs!H96=\"\",\"Descrição não preeenchida\",\"ok\"),\"--\")","v":"--"}]
[93,{"$f":"IFERROR(IF(VLOOKUP($A97,URLs!B$5:J$104,3,)<>0,VLOOKUP($A97,URLs!B$5:J$104,3,),\"\"),\"\")","v":""},{"$f":"IFERROR(IF(VLOOKUP($A97,URLs!B$5:J$104,9,)<>0,VLOOKUP($A97,URLs!B$5:J$104,9,),\"\"),\"\")","v":""},0,{"$f":"IF(C97<>\"\",IFERROR(IF(SEARCH($C97,URLs!E97,1),\"ok\"),\"Palavra-chave não encontrada no título\"),\"--\")","v":"--"},{"$f":"IF(C97<>\"\",IFERROR(IF(SEARCH(SUBSTITUTE(tiraAcento($C97),\" \",\"-\"),URLs!D97,1),\"ok\"),\"Palavra-chave não encontrada na URL\"),\"--\")","v":"--"},{"$f":"IF(C97<>\"\",IFERROR(IF(SEARCH($C97,URLs!K97,1),\"ok\"),\"Palavra-chave não encontrada no Título H1\"),\"--\")","v":"--"},{"$f":"IF(C97<>\"\",IFERROR(IF(SEARCH($C97,URLs!L97,1),\"ok\"),\"Palavra-chave não encontrada na imagem\"),\"--\")","v":"--"},{"$f":"IF(C97<>\"\",IF(URLs!H97=\"\",\"Descrição não preeenchida\",\"ok\"),\"--\")","v":"--"}]
[94,{"$f":"IFERROR(IF(VLOOKUP($A98,URLs!B$5:J$104,3,)<>0,VLOOKUP($A98,URLs!B$5:J$104,3,),\"\"),\"\")","v":""},{"$f":"IFERROR(IF(VLOOKUP($A98,URLs!B$5:J$104,9,)<>0,VLOOKUP($A98,URLs!B$5:J$104,9,),\"\"),\"\")","v":""},0,{"$f":"IF(C98<>\"\",IFERROR(IF(SEARCH($C98,URLs!E98,1),\"ok\"),\"Palavra-chave não encontrada no título\"),\"--\")","v":"--"},{"$f":"IF(C98<>\"\",IFERROR(IF(SEARCH(SUBSTITUTE(tiraAcento($C98),\" \",\"-\"),URLs!D98,1),\"ok\"),\"Palavra-chave não encontrada na URL\"),\"--\")","v":"--"},{"$f":"IF(C98<>\"\",IFERROR(IF(SEARCH($C98,URLs!K98,1),\"ok\"),\"Palavra-chave não encontrada no Título H1\"),\"--\")","v":"--"},{"$f":"IF(C98<>\"\",IFERROR(IF(SEARCH($C98,URLs!L98,1),\"ok\"),\"Palavra-chave não encontrada na imagem\"),\"--\")","v":"--"},{"$f":"IF(C98<>\"\",IF(URLs!H98=\"\",\"Descrição não preeenchida\",\"ok\"),\"--\")","v":"--"}]
[95,{"$f":"IFERROR(IF(VLOOKUP($A99,URLs!B$5:J$104,3,)<>0,VLOOKUP($A99,URLs!B$5:J$104,3,),\"\"),\"\")","v":""},{"$f":"IFERROR(IF(VLOOKUP($A99,URLs!B$5:J$104,9,)<>0,VLOOKUP($A99,URLs!B$5:J$104,9,),\"\"),\"\")","v":""},0,{"$f":"IF(C99<>\"\",IFERROR(IF(SEARCH($C99,URLs!E99,1),\"ok\"),\"Palavra-chave não encontrada no título\"),\"--\")","v":"--"},{"$f":"IF(C99<>\"\",IFERROR(IF(SEARCH(SUBSTITUTE(tiraAcento($C99),\" \",\"-\"),URLs!D99,1),\"ok\"),\"Palavra-chave não encontrada na URL\"),\"--\")","v":"--"},{"$f":"IF(C99<>\"\",IFERROR(IF(SEARCH($C99,URLs!K99,1),\"ok\"),\"Palavra-chave não encontrada no Título H1\"),\"--\")","v":"--"},{"$f":"IF(C99<>\"\",IFERROR(IF(SEARCH($C99,URLs!L99,1),\"ok\"),\"Palavra-chave não encontrada na imagem\"),\"--\")","v":"--"},{"$f":"IF(C99<>\"\",IF(URLs!H99=\"\",\"Descrição não preeenchida\",\"ok\"),\"--\")","v":"--"}]
[96,{"$f":"IFERROR(IF(VLOOKUP($A100,URLs!B$5:J$104,3,)<>0,VLOOKUP($A100,URLs!B$5:J$104,3,),\"\"),\"\")","v":""},{"$f":"IFERROR(IF(VLOOKUP($A100,URLs!B$5:J$104,9,)<>0,VLOOKUP($A100,URLs!B$5:J$104,9,),\"\"),\"\")","v":""},0,{"$f":"IF(C100<>\"\",IFERROR(IF(SEARCH($C100,URLs!E100,1),\"ok\"),\"Palavra-chave não encontrada no título\"),\"--\")","v":"--"},{"$f":"IF(C100<>\"\",IFERROR(IF(SEARCH(SUBSTITUTE(tiraAcento($C100),\" \",\"-\"),URLs!D100,1),\"ok\"),\"Palavra-chave não encontrada na URL\"),\"--\")","v":"--"},{"$f":"IF(C100<>\"\",IFERROR(IF(SEARCH($C100,URLs!K100,1),\"ok\"),\"Palavra-chave não encontrada no Título H1\"),\"--\")","v":"--"},{"$f":"IF(C100<>\"\",IFERROR(IF(SEARCH($C100,URLs!L100,1),\"ok\"),\"Palavra-chave não encontrada na imagem\"),\"--\")","v":"--"},{"$f":"IF(C100<>\"\",IF(URLs!H100=\"\",\"Descrição não preeenchida\",\"ok\"),\"--\")","v":"--"}]
[97,{"$f":"IFERROR(IF(VLOOKUP($A101,URLs!B$5:J$104,3,)<>0,VLOOKUP($A101,URLs!B$5:J$104,3,),\"\"),\"\")","v":""},{"$f":"IFERROR(IF(VLOOKUP($A101,URLs!B$5:J$104,9,)<>0,VLOOKUP($A101,URLs!B$5:J$104,9,),\"\"),\"\")","v":""},0,{"$f":"IF(C101<>\"\",IFERROR(IF(SEARCH($C101,URLs!E101,1),\"ok\"),\"Palavra-chave não encontrada no título\"),\"--\")","v":"--"},{"$f":"IF(C101<>\"\",IFERROR(IF(SEARCH(SUBSTITUTE(tiraAcento($C101),\" \",\"-\"),URLs!D101,1),\"ok\"),\"Palavra-chave não encontrada na URL\"),\"--\")","v":"--"},{"$f":"IF(C101<>\"\",IFERROR(IF(SEARCH($C101,URLs!K101,1),\"ok\"),\"Palavra-chave não encontrada no Título H1\"),\"--\")","v":"--"},{"$f":"IF(C101<>\"\",IFERROR(IF(SEARCH($C101,URLs!L101,1),\"ok\"),\"Palavra-chave não encontrada na imagem\"),\"--\")","v":"--"},{"$f":"IF(C101<>\"\",IF(URLs!H101=\"\",\"Descrição não preeenchida\",\"ok\"),\"--\")","v":"--"}]
[98,{"$f":"IFERROR(IF(VLOOKUP($A102,URLs!B$5:J$104,3,)<>0,VLOOKUP($A102,URLs!B$5:J$104,3,),\"\"),\"\")","v":""},{"$f":"IFERROR(IF(VLOOKUP($A102,URLs!B$5:J$104,9,)<>0,VLOOKUP($A102,URLs!B$5:J$104,9,),\"\"),\"\")","v":""},0,{"$f":"IF(C102<>\"\",IFERROR(IF(SEARCH($C102,URLs!E102,1),\"ok\"),\"Palavra-chave não encontrada no título\"),\"--\")","v":"--"},{"$f":"IF(C102<>\"\",IFERROR(IF(SEARCH(SUBSTITUTE(tiraAcento($C102),\" \",\"-\"),URLs!D102,1),\"ok\"),\"Palavra-chave não encontrada na URL\"),\"--\")","v":"--"},{"$f":"IF(C102<>\"\",IFERROR(IF(SEARCH($C102,URLs!K102,1),\"ok\"),\"Palavra-chave não encontrada no Título H1\"),\"--\")","v":"--"},{"$f":"IF(C102<>\"\",IFERROR(IF(SEARCH($C102,URLs!L102,1),\"ok\"),\"Palavra-chave não encontrada na imagem\"),\"--\")","v":"--"},{"$f":"IF(C102<>\"\",IF(URLs!H102=\"\",\"Descrição não preeenchida\",\"ok\"),\"--\")","v":"--"}]
[99,{"$f":"IFERROR(IF(VLOOKUP($A103,URLs!B$5:J$104,3,)<>0,VLOOKUP($A103,URLs!B$5:J$104,3,),\"\"),\"\")","v":""},{"$f":"IFERROR(IF(VLOOKUP($A103,URLs!B$5:J$104,9,)<>0,VLOOKUP($A103,URLs!B$5:J$104,9,),\"\"),\"\")","v":""},0,{"$f":"IF(C103<>\"\",IFERROR(IF(SEARCH($C103,URLs!E103,1),\"ok\"),\"Palavra-chave não encontrada no título\"),\"--\")","v":"--"},{"$f":"IF(C103<>\"\",IFERROR(IF(SEARCH(SUBSTITUTE(tiraAcento($C103),\" \",\"-\"),URLs!D103,1),\"ok\"),\"Palavra-chave não encontrada na URL\"),\"--\")","v":"--"},{"$f":"IF(C103<>\"\",IFERROR(IF(SEARCH($C103,URLs!K103,1),\"ok\"),\"Palavra-chave não encontrada no Título H1\"),\"--\")","v":"--"},{"$f":"IF(C103<>\"\",IFERROR(IF(SEARCH($C103,URLs!L103,1),\"ok\"),\"Palavra-chave não encontrada na imagem\"),\"--\")","v":"--"},{"$f":"IF(C103<>\"\",IF(URLs!H103=\"\",\"Descrição não preeenchida\",\"ok\"),\"--\")","v":"--"}]
[100,{"$f":"IFERROR(IF(VLOOKUP($A104,URLs!B$5:J$104,3,)<>0,VLOOKUP($A104,URLs!B$5:J$104,3,),\"\"),\"\")","v":""},{"$f":"IFERROR(IF(VLOOKUP($A104,URLs!B$5:J$104,9,)<>0,VLOOKUP($A104,URLs!B$5:J$104,9,),\"\"),\"\")","v":""},0,{"$f":"IF(C104<>\"\",IFERROR(IF(SEARCH($C104,URLs!E104,1),\"ok\"),\"Palavra-chave não encontrada no título\"),\"--\")","v":"--"},{"$f":"IF(C104<>\"\",IFERROR(IF(SEARCH(SUBSTITUTE(tiraAcento($C104),\" \",\"-\"),URLs!D104,1),\"ok\"),\"Palavra-chave não encontrada na URL\"),\"--\")","v":"--"},{"$f":"IF(C104<>\"\",IFERROR(IF(SEARCH($C104,URLs!K104,1),\"ok\"),\"Palavra-chave não encontrada no Título H1\"),\"--\")","v":"--"},{"$f":"IF(C104<>\"\",IFERROR(IF(SEARCH($C104,URLs!L104,1),\"ok\"),\"Palavra-chave não encontrada na imagem\"),\"--\")","v":"--"},{"$f":"IF(C104<>\"\",IF(URLs!H104=\"\",\"Descrição não preeenchida\",\"ok\"),\"--\")","v":"--"}]

{"sheet":"Infos","index":2,"n_rows":21,"n_cols":12,"rows_kept":21,"cut":false,"hidden":false,"merged":[[16,1,16,6],[17,1,17,6],[20,1,20,6],[4,10,4,19],[1,1,1,7],[2,1,2,7],[5,2,5,7],[7,2,7,7],[9,2,9,7],[12,1,14,6],[3,1,3,7]]}
[]
[null,"Planilha de SEO"]
[null,"Criada por Felipe Silva"]
[null,"Consultoria e Treinamento de SEO"]
[null,null,null,null,null,null,null,null,null,null,"Dicas de uso:"]
[null,null,"felipercsilva.net.br",null,null,null,null,null,null,null,"1 - Insira a URL da página na coluna URL;"]
[null,null,null,null,null,null,null,null,null,null,"2 - Copie e otimize o título <title> da página;"]
[null,null,"felipercsilva@gmail.com",null,null,null,null,null,null,null,"3 - Copie e otimize a description da página;"]
[null,null,null,null,null,null,null,null,null,null,"4 - Copie e otimize o título H1 da página;"]
[null,null,"https://www.linkedin.com/in/felipercsilva/pt",null,null,null,null,null,null,null,"5 - Copie e otimize o texto alternativo (alt) da principal imagem;"]
[null,null,null,null,null,null,null,null,null,null,"6 - Na coluna \"palavra-chave\""," coloque a principal palavra-chave daquela página;"]
[null,null,null,null,null,null,null,null,null,null,"7 - Na PLANILHA \"palavras-chave\",  veja o índice de otimização da página e otimizações recomendadas."]
[null,"Envie seu feedback para otimizar nossa planilha de SEO"]
[]
[]
[]
[null,"Download e atualizações em:"]
[null,"https://felipercsilva.net.br/planilha-seo/"]
[]
[]
[null,"Versão beta - 21/11/2018"]