{"text_format":"1","workbook":"xlsx","n_sheets":3,"sheets":["URLs","Palavras-chave","Infos"],"not_rendered":{"charts":0,"images":3,"macros":1,"external_links":0,"defined_names":0,"comments":0,"pivot_tables":0},"unopened":[],"bounds":{"document_bytes":16777216,"sheet_cells":100000,"rows_first":2000,"rows_last":500,"rows_between":2000,"halvings":0,"cell_chars":16384,"cell_head_chars":4096},"cells_cut":0,"cells_raw":0,"read":"whole","date_system":"1900"}

{"sheet":"URLs","index":0,"n_rows":104,"n_cols":12,"rows_kept":104,"cut":false,"hidden":false,"merged":[[0,0,0,4],[0,7,0,8],[1,0,1,11]]}
[]
["SEO - Títulos otimizados"]
["Tipo da página","#","Código Prod","URL","Título <title>","Título <title>","Tamanho","Descrição - description","Tamanho","Palavra-chave\nPreencha aqui!","Título H1","Alt Imagem Principal"]
["i.e. website page, blog post, landing page etc.",0,null,null,null,null,"Média de 60 caracteres",null,"Máximo de 160 caracteres"]
["Home",1,null,"https://www.site.com.br/","F Eletrônicos - Computadores, MacBook, iPhone",null,{"$f":"LEN(CONCATENATE(E5,F5))","v":45},null,{"$f":"LEN(H5)","v":0}]
["Categoria",2,null,"https://www.site.com.br/apple","Apple - MacBook, iPhone, iPad"," | F Eletrônicos",45,null,0,"Apple"]
["SubCategoria",3,null,"https://www.site.com.br/apple/iphone","Apple iPhone em oferta - iPhone Xs e iPhone 8 em Promoção"," | F Eletrônicos",73,"Todos os modelos de iPhone em promoção na F Eletrônicos. ",57,"iPhone"]
["Produto",4,1234,"https://www.site.com.br/iphone-xs","iPhone Xs em Oferta"," | F Eletrônicos",35,"Compre o iPhone Xs em 10x sem juros e Frete Grátis na F Eletrônicos. Confira!",77,"iPhone xs","iPhone Xs Apple 128Gb Branco","iPhone Xs Branco"]
["YouTube",5,null,"https://www.youtube.com/","Como usar os novos recursos do iPhone Xs"," - YouTube",50,null,0,"iPhone xs","Como usar os novos recursos do iPhone Xs"]
["Mercado Livre",6,null,"https://produto.mercadolivre.com.br/MLB-1101645772-obaphone-barra-celular-para-idosos-obabox-_JM","Obaphone Barra - Celular Para Idosos Obabox - R$ 229,80"," em Mercado Livre",72,"Compre-o no Mercado Livre por R$ 229,80 - Compre em 12 parcelas - Frete grátis. Encontre mais produtos de Eletrônicos, Áudio e Vídeo, Outros Eletrônicos.",153,"ObaPhone","Obaphone Barra - Celular Para Idosos Obabox"]
[null,7,null,null,null,null,0,null,0]
[null,8,null,null,null,null,0,null,0]
[null,9,null,null,null,null,0,null,0]
[null,10,null,null,null,null,0,null,0]
[null,11,null,null,null,null,0,null,0]
[null,12,null,null,null,null,0,null,0]
[null,13,null,null,null,null,0,null,0]
[null,14,null,null,null,null,0,null,0]
[null,15,null,null,null,null,0,null,0]
[null,16,null,null,null,null,0,null,0]
{"$rows_left_out":85}
{"sheet":"Palavras-chave","index":1,"n_rows":104,"n_cols":9,"rows_kept":104,"cut":false,"hidden":false,"merged":[[2,1,3,1],[0,0,0,2],[0,3,0,5],[2,2,2,5],[1,0,1,8]]}
[]
["SEO - Análise de palavras-chave"]
["#","URL","SEO"]
[0,null,"Palavra-chave\nNão alterar","Otimizado","Título <title>","URL","H1","alt image","Description"]
[1,{"$f":"IFERROR(IF(VLOOKUP($A5,URLs!B$5:J$104,3,)<>0,VLOOKUP($A5,URLs!B$5:J$104,3,),\"\"),\"\")","v":"https://www.site.com.br/"},{"$f":"IFERROR(IF(VLOOKUP($A5,URLs!B$5:J$104,9,)<>0,VLOOKUP($A5,URLs!B$5:J$104,9,),\"\"),\"\")","v":""},{"$f":"IF(C5=\"\",0%,COUNTIF(E5:I5,\"ok\")/COUNTA(E$4:I$4))","v":0},{"$f":"IF(C5<>\"\",IFERROR(IF(SEARCH($C5,URLs!E5,1),\"ok\"),\"Palavra-chave não encontrada no título\"),\"--\")","v":"--"},{"$f":"IF(C5<>\"\",IFERROR(IF(SEARCH(SUBSTITUTE(tiraAcento($C5),\" \",\"-\"),URLs!D5,1),\"ok\"),\"Palavra-chave não encontrada na URL\"),\"--\")","v":"--"},{"$f":"IF(C5<>\"\",IFERROR(IF(SEARCH($C5,URLs!K5,1),\"ok\"),\"Palavra-chave não encontrada no Título H1\"),\"--\")","v":"--"},{"$f":"IF(C5<>\"\",IFERROR(IF(SEARCH($C5,URLs!L5,1),\"ok\"),\"Palavra-chave não encontrada na imagem\"),\"--\")","v":"--"},{"$f":"IF(C5<>\"\",IF(URLs!H5=\"\",\"Descrição não preeenchida\",\"ok\"),\"--\")","v":"--"}]
[2,{"$f":"IFERROR(IF(VLOOKUP($A6,URLs!B$5:J$104,3,)<>0,VLOOKUP($A6,URLs!B$5:J$104,3,),\"\"),\"\")","v":"https://www.site.com.br/apple"},{"$f":"IFERROR(IF(VLOOKUP($A6,URLs!B$5:J$104,9,)<>0,VLOOKUP($A6,URLs!B$5:J$104,9,),\"\"),\"\")","v":"Apple"},{"$f":"IF(C6=\"\",0%,COUNTIF(E6:I6,\"ok\")/COUNTA(E$4:I$4))","v":0.4},{"$f":"IF(C6<>\"\",IFERROR(IF(SEARCH($C6,URLs!E6,1),\"ok\"),\"Palavra-chave não encontrada no título\"),\"--\")","v":"ok"},{"$f":"IF(C6<>\"\",IFERROR(IF(SEARCH(SUBSTITUTE(tiraAcento($C6),\" \",\"-\"),URLs!D6,1),\"ok\"),\"Palavra-chave não encontrada na URL\"),\"--\")","v":"ok"},{"$f":"IF(C6<>\"\",IFERROR(IF(SEARCH($C6,URLs!K6,1),\"ok\"),\"Palavra-chave não encontrada no Título H1\"),\"--\")","v":"Palavra-chave não encontrada no Título H1"},{"$f":"IF(C6<>\"\",IFERROR(IF(SEARCH($C6,URLs!L6,1),\"ok\"),\"Palavra-chave não encontrada na imagem\"),\"--\")","v":"Palavra-chave não encontrada na imagem"},{"$f":"IF(C6<>\"\",IF(URLs!H6=\"\",\"Descrição não preeenchida\",\"ok\"),\"--\")","v":"Descrição não preeenchida"}]
[3,{"$f":"IFERROR(IF(VLOOKUP($A7,URLs!B$5:J$104,3,)<>0,VLOOKUP($A7,URLs!B$5:J$104,3,),\"\"),\"\")","v":"https://www.site.com.br/apple/iphone"},{"$f":"IFERROR(IF(VLOOKUP($A7,URLs!B$5:J$104,9,)<>0,VLOOKUP($A7,URLs!B$5:J$104,9,),\"\"),\"\")","v":"iPhone"},0.6,{"$f":"IF(C7<>\"\",IFERROR(IF(SEARCH($C7,URLs!E7,1),\"ok\"),\"Palavra-chave não encontrada no título\"),\"--\")","v":"ok"},{"$f":"IF(C7<>\"\",IFERROR(IF(SEARCH(SUBSTITUTE(tiraAcento($C7),\" \",\"-\"),URLs!D7,1),\"ok\"),\"Palavra-chave não encontrada na URL\"),\"--\")","v":"ok"},{"$f":"IF(C7<>\"\",IFERROR(IF(SEARCH($C7,URLs!K7,1),\"ok\"),\"Palavra-chave não encontrada no Título H1\"),\"--\")","v":"Palavra-chave não encontrada no Título H1"},{"$f":"IF(C7<>\"\",IFERROR(IF(SEARCH($C7,URLs!L7,1),\"ok\"),\"Palavra-chave não encontrada na imagem\"),\"--\")","v":"Palavra-chave não encontrada na imagem"},{"$f":"IF(C7<>\"\",IF(URLs!H7=\"\",\"Descrição não preeenchida\",\"ok\"),\"--\")","v":"ok"}]
[4,{"$f":"IFERROR(IF(VLOOKUP($A8,URLs!B$5:J$104,3,)<>0,VLOOKUP($A8,URLs!B$5:J$104,3,),\"\"),\"\")","v":"https://www.site.com.br/iphone-xs"},{"$f":"IFERROR(IF(VLOOKUP($A8,URLs!B$5:J$104,9,)<>0,VLOOKUP($A8,URLs!B$5:J$104,9,),\"\"),\"\")","v":"iPhone xs"},1,{"$f":"IF(C8<>\"\",IFERROR(IF(SEARCH($C8,URLs!E8,1),\"ok\"),\"Palavra-chave não encontrada no título\"),\"--\")","v":"ok"},{"$f":"IF(C8<>\"\",IFERROR(IF(SEARCH(SUBSTITUTE(tiraAcento($C8),\" \",\"-\"),URLs!D8,1),\"ok\"),\"Palavra-chave não encontrada na URL\"),\"--\")","v":"ok"},{"$f":"IF(C8<>\"\",IFERROR(IF(SEARCH($C8,URLs!K8,1),\"ok\"),\"Palavra-chave não encontrada no Título H1\"),\"--\")","v":"ok"},{"$f":"IF(C8<>\"\",IFERROR(IF(SEARCH($C8,URLs!L8,1),\"ok\"),\"Palavra-chave não encontrada na imagem\"),\"--\")","v":"ok"},{"$f":"IF(C8<>\"\",IF(URLs!H8=\"\",\"Descrição não preeenchida\",\"ok\"),\"--\")","v":"ok"}]
[5,{"$f":"IFERROR(IF(VLOOKUP($A9,URLs!B$5:J$104,3,)<>0,VLOOKUP($A9,URLs!B$5:J$104,3,),\"\"),\"\")","v":"https://www.youtube.com/"},{"$f":"IFERROR(IF(VLOOKUP($A9,URLs!B$5:J$104,9,)<>0,VLOOKUP($A9,URLs!B$5:J$104,9,),\"\"),\"\")","v":"iPhone xs"},0.4,{"$f":"IF(C9<>\"\",IFERROR(IF(SEARCH($C9,URLs!E9,1),\"ok\"),\"Palavra-chave não encontrada no título\"),\"--\")","v":"ok"},{"$f":"IF(C9<>\"\",IFERROR(IF(SEARCH(SUBSTITUTE(tiraAcento($C9),\" \",\"-\"),URLs!D9,1),\"ok\"),\"Palavra-chave não encontrada na URL\"),\"--\")","v":"Palavra-chave não encontrada na URL"},{"$f":"IF(C9<>\"\",IFERROR(IF(SEARCH($C9,URLs!K9,1),\"ok\"),\"Palavra-chave não encontrada no Título H1\"),\"--\")","v":"ok"},{"$f":"IF(C9<>\"\",IFERROR(IF(SEARCH($C9,URLs!L9,1),\"ok\"),\"Palavra-chave não encontrada na imagem\"),\"--\")","v":"Palavra-chave não encontrada na imagem"},{"$f":"IF(C9<>\"\",IF(URLs!H9=\"\",\"Descrição não preeenchida\",\"ok\"),\"--\")","v":"Descrição não preeenchida"}]
[6,{"$f":"IFERROR(IF(VLOOKUP($A10,URLs!B$5:J$104,3,)<>0,VLOOKUP($A10,URLs!B$5:J$104,3,),\"\"),\"\")","v":"https://produto.mercadolivre.com.br/MLB-1101645772-obaphone-barra-celular-para-idosos-obabox-_JM"},{"$f":"IFERROR(IF(VLOOKUP($A10,URLs!B$5:J$104,9,)<>0,VLOOKUP($A10,URLs!B$5:J$104,9,),\"\"),\"\")","v":"ObaPhone"},0.8,{"$f":"IF(C10<>\"\",IFERROR(IF(SEARCH($C10,URLs!E10,1),\"ok\"),\"Palavra-chave não encontrada no título\"),\"--\")","v":"ok"},{"$f":"IF(C10<>\"\",IFERROR(IF(SEARCH(SUBSTITUTE(tiraAcento($C10),\" \",\"-\"),URLs!D10,1),\"ok\"),\"Palavra-chave não encontrada na URL\"),\"--\")","v":"ok"},{"$f":"IF(C10<>\"\",IFERROR(IF(SEARCH($C10,URLs!K10,1),\"ok\"),\"Palavra-chave não encontrada no Título H1\"),\"--\")","v":"ok"},{"$f":"IF(C10<>\"\",IFERROR(IF(SEARCH($C10,URLs!L10,1),\"ok\"),\"Palavra-chave não encontrada na imagem\"),\"--\")","v":"Palavra-chave não encontrada na imagem"},{"$f":"IF(C10<>\"\",IF(URLs!H10=\"\",\"Descrição não preeenchida\",\"ok\"),\"--\")","v":"ok"}]
[7,{"$f":"IFERROR(IF(VLOOKUP($A11,URLs!B$5:J$104,3,)<>0,VLOOKUP($A11,URLs!B$5:J$104,3,),\"\"),\"\")","v":""},{"$f":"IFERROR(IF(VLOOKUP($A11,URLs!B$5:J$104,9,)<>0,VLOOKUP($A11,URLs!B$5:J$104,9,),\"\"),\"\")","v":""},0,{"$f":"IF(C11<>\"\",IFERROR(IF(SEARCH($C11,URLs!E11,1),\"ok\"),\"Palavra-chave não encontrada no título\"),\"--\")","v":"--"},{"$f":"IF(C11<>\"\",IFERROR(IF(SEARCH(SUBSTITUTE(tiraAcento($C11),\" \",\"-\"),URLs!D11,1),\"ok\"),\"Palavra-chave não encontrada na URL\"),\"--\")","v":"--"},{"$f":"IF(C11<>\"\",IFERROR(IF(SEARCH($C11,URLs!K11,1),\"ok\"),\"Palavra-chave não encontrada no Título H1\"),\"--\")","v":"--"},{"$f":"IF(C11<>\"\",IFERROR(IF(SEARCH($C11,URLs!L11,1),\"ok\"),\"Palavra-chave não encontrada na imagem\"),\"--\")","v":"--"},{"$f":"IF(C11<>\"\",IF(URLs!H11=\"\",\"Descrição não preeenchida\",\"ok\"),\"--\")","v":"--"}]
[8,{"$f":"IFERROR(IF(VLOOKUP($A12,URLs!B$5:J$104,3,)<>0,VLOOKUP($A12,URLs!B$5:J$104,3,),\"\"),\"\")","v":""},{"$f":"IFERROR(IF(VLOOKUP($A12,URLs!B$5:J$104,9,)<>0,VLOOKUP($A12,URLs!B$5:J$104,9,),\"\"),\"\")","v":""},0,{"$f":"IF(C12<>\"\",IFERROR(IF(SEARCH($C12,URLs!E12,1),\"ok\"),\"Palavra-chave não encontrada no título\"),\"--\")","v":"--"},{"$f":"IF(C12<>\"\",IFERROR(IF(SEARCH(SUBSTITUTE(tiraAcento($C12),\" \",\"-\"),URLs!D12,1),\"ok\"),\"Palavra-chave não encontrada na URL\"),\"--\")","v":"--"},{"$f":"IF(C12<>\"\",IFERROR(IF(SEARCH($C12,URLs!K12,1),\"ok\"),\"Palavra-chave não encontrada no Título H1\"),\"--\")","v":"--"},{"$f":"IF(C12<>\"\",IFERROR(IF(SEARCH($C12,URLs!L12,1),\"ok\"),\"Palavra-chave não encontrada na imagem\"),\"--\")","v":"--"},{"$f":"IF(C12<>\"\",IF(URLs!H12=\"\",\"Descrição não preeenchida\",\"ok\"),\"--\")","v":"--"}]
[9,{"$f":"IFERROR(IF(VLOOKUP($A13,URLs!B$5:J$104,3,)<>0,VLOOKUP($A13,URLs!B$5:J$104,3,),\"\"),\"\")","v":""},{"$f":"IFERROR(IF(VLOOKUP($A13,URLs!B$5:J$104,9,)<>0,VLOOKUP($A13,URLs!B$5:J$104,9,),\"\"),\"\")","v":""},0,{"$f":"IF(C13<>\"\",IFERROR(IF(SEARCH($C13,URLs!E13,1),\"ok\"),\"Palavra-chave não encontrada no título\"),\"--\")","v":"--"},{"$f":"IF(C13<>\"\",IFERROR(IF(SEARCH(SUBSTITUTE(tiraAcento($C13),\" \",\"-\"),URLs!D13,1),\"ok\"),\"Palavra-chave não encontrada na URL\"),\"--\")","v":"--"},{"$f":"IF(C13<>\"\",IFERROR(IF(SEARCH($C13,URLs!K13,1),\"ok\"),\"Palavra-chave não encontrada no Título H1\"),\"--\")","v":"--"},{"$f":"IF(C13<>\"\",IFERROR(IF(SEARCH($C13,URLs!L13,1),\"ok\"),\"Palavra-chave não encontrada na imagem\"),\"--\")","v":"--"},{"$f":"IF(C13<>\"\",IF(URLs!H13=\"\",\"Descrição não preeenchida\",\"ok\"),\"--\")","v":"--"}]
[10,{"$f":"IFERROR(IF(VLOOKUP($A14,URLs!B$5:J$104,3,)<>0,VLOOKUP($A14,URLs!B$5:J$104,3,),\"\"),\"\")","v":""},{"$f":"IFERROR(IF(VLOOKUP($A14,URLs!B$5:J$104,9,)<>0,VLOOKUP($A14,URLs!B$5:J$104,9,),\"\"),\"\")","v":""},0,{"$f":"IF(C14<>\"\",IFERROR(IF(SEARCH($C14,URLs!E14,1),\"ok\"),\"Palavra-chave não encontrada no título\"),\"--\")","v":"--"},{"$f":"IF(C14<>\"\",IFERROR(IF(SEARCH(SUBSTITUTE(tiraAcento($C14),\" \",\"-\"),URLs!D14,1),\"ok\"),\"Palavra-chave não encontrada na URL\"),\"--\")","v":"--"},{"$f":"IF(C14<>\"\",IFERROR(IF(SEARCH($C14,URLs!K14,1),\"ok\"),\"Palavra-chave não encontrada no Título H1\"),\"--\")","v":"--"},{"$f":"IF(C14<>\"\",IFERROR(IF(SEARCH($C14,URLs!L14,1),\"ok\"),\"Palavra-chave não encontrada na imagem\"),\"--\")","v":"--"},{"$f":"IF(C14<>\"\",IF(URLs!H14=\"\",\"Descrição não preeenchida\",\"ok\"),\"--\")","v":"--"}]
[11,{"$f":"IFERROR(IF(VLOOKUP($A15,URLs!B$5:J$104,3,)<>0,VLOOKUP($A15,URLs!B$5:J$104,3,),\"\"),\"\")","v":""},{"$f":"IFERROR(IF(VLOOKUP($A15,URLs!B$5:J$104,9,)<>0,VLOOKUP($A15,URLs!B$5:J$104,9,),\"\"),\"\")","v":""},0,{"$f":"IF(C15<>\"\",IFERROR(IF(SEARCH($C15,URLs!E15,1),\"ok\"),\"Palavra-chave não encontrada no título\"),\"--\")","v":"--"},{"$f":"IF(C15<>\"\",IFERROR(IF(SEARCH(SUBSTITUTE(tiraAcento($C15),\" \",\"-\"),URLs!D15,1),\"ok\"),\"Palavra-chave não encontrada na URL\"),\"--\")","v":"--"},{"$f":"IF(C15<>\"\",IFERROR(IF(SEARCH($C15,URLs!K15,1),\"ok\"),\"Palavra-chave não encontrada no Título H1\"),\"--\")","v":"--"},{"$f":"IF(C15<>\"\",IFERROR(IF(SEARCH($C15,URLs!L15,1),\"ok\"),\"Palavra-chave não encontrada na imagem\"),\"--\")","v":"--"},{"$f":"IF(C15<>\"\",IF(URLs!H15=\"\",\"Descrição não preeenchida\",\"ok\"),\"--\")","v":"--"}]
[12,{"$f":"IFERROR(IF(VLOOKUP($A16,URLs!B$5:J$104,3,)<>0,VLOOKUP($A16,URLs!B$5:J$104,3,),\"\"),\"\")","v":""},{"$f":"IFERROR(IF(VLOOKUP($A16,URLs!B$5:J$104,9,)<>0,VLOOKUP($A16,URLs!B$5:J$104,9,),\"\"),\"\")","v":""},0,{"$f":"IF(C16<>\"\",IFERROR(IF(SEARCH($C16,URLs!E16,1),\"ok\"),\"Palavra-chave não encontrada no título\"),\"--\")","v":"--"},{"$f":"IF(C16<>\"\",IFERROR(IF(SEARCH(SUBSTITUTE(tiraAcento($C16),\" \",\"-\"),URLs!D16,1),\"ok\"),\"Palavra-chave não encontrada na URL\"),\"--\")","v":"--"},{"$f":"IF(C16<>\"\",IFERROR(IF(SEARCH($C16,URLs!K16,1),\"ok\"),\"Palavra-chave não encontrada no Título H1\"),\"--\")","v":"--"},{"$f":"IF(C16<>\"\",IFERROR(IF(SEARCH($C16,URLs!L16,1),\"ok\"),\"Palavra-chave não encontrada na imagem\"),\"--\")","v":"--"},{"$f":"IF(C16<>\"\",IF(URLs!H16=\"\",\"Descrição não preeenchida\",\"ok\"),\"--\")","v":"--"}]
[13,{"$f":"IFERROR(IF(VLOOKUP($A17,URLs!B$5:J$104,3,)<>0,VLOOKUP($A17,URLs!B$5:J$104,3,),\"\"),\"\")","v":""},{"$f":"IFERROR(IF(VLOOKUP($A17,URLs!B$5:J$104,9,)<>0,VLOOKUP($A17,URLs!B$5:J$104,9,),\"\"),\"\")","v":""},0,{"$f":"IF(C17<>\"\",IFERROR(IF(SEARCH($C17,URLs!E17,1),\"ok\"),\"Palavra-chave não encontrada no título\"),\"--\")","v":"--"},{"$f":"IF(C17<>\"\",IFERROR(IF(SEARCH(SUBSTITUTE(tiraAcento($C17),\" \",\"-\"),URLs!D17,1),\"ok\"),\"Palavra-chave não encontrada na URL\"),\"--\")","v":"--"},{"$f":"IF(C17<>\"\",IFERROR(IF(SEARCH($C17,URLs!K17,1),\"ok\"),\"Palavra-chave não encontrada no Título H1\"),\"--\")","v":"--"},{"$f":"IF(C17<>\"\",IFERROR(IF(SEARCH($C17,URLs!L17,1),\"ok\"),\"Palavra-chave não encontrada na imagem\"),\"--\")","v":"--"},{"$f":"IF(C17<>\"\",IF(URLs!H17=\"\",\"Descrição não preeenchida\",\"ok\"),\"--\")","v":"--"}]
[14,{"$f":"IFERROR(IF(VLOOKUP($A18,URLs!B$5:J$104,3,)<>0,VLOOKUP($A18,URLs!B$5:J$104,3,),\"\"),\"\")","v":""},{"$f":"IFERROR(IF(VLOOKUP($A18,URLs!B$5:J$104,9,)<>0,VLOOKUP($A18,URLs!B$5:J$104,9,),\"\"),\"\")","v":""},0,{"$f":"IF(C18<>\"\",IFERROR(IF(SEARCH($C18,URLs!E18,1),\"ok\"),\"Palavra-chave não encontrada no título\"),\"--\")","v":"--"},{"$f":"IF(C18<>\"\",IFERROR(IF(SEARCH(SUBSTITUTE(tiraAcento($C18),\" \",\"-\"),URLs!D18,1),\"ok\"),\"Palavra-chave não encontrada na URL\"),\"--\")","v":"--"},{"$f":"IF(C18<>\"\",IFERROR(IF(SEARCH($C18,URLs!K18,1),\"ok\"),\"Palavra-chave não encontrada no Título H1\"),\"--\")","v":"--"},{"$f":"IF(C18<>\"\",IFERROR(IF(SEARCH($C18,URLs!L18,1),\"ok\"),\"Palavra-chave não encontrada na imagem\"),\"--\")","v":"--"},{"$f":"IF(C18<>\"\",IF(URLs!H18=\"\",\"Descrição não preeenchida\",\"ok\"),\"--\")","v":"--"}]
[15,{"$f":"IFERROR(IF(VLOOKUP($A19,URLs!B$5:J$104,3,)<>0,VLOOKUP($A19,URLs!B$5:J$104,3,),\"\"),\"\")","v":""},{"$f":"IFERROR(IF(VLOOKUP($A19,URLs!B$5:J$104,9,)<>0,VLOOKUP($A19,URLs!B$5:J$104,9,),\"\"),\"\")","v":""},0,{"$f":"IF(C19<>\"\",IFERROR(IF(SEARCH($C19,URLs!E19,1),\"ok\"),\"Palavra-chave não encontrada no título\"),\"--\")","v":"--"},{"$f":"IF(C19<>\"\",IFERROR(IF(SEARCH(SUBSTITUTE(tiraAcento($C19),\" \",\"-\"),URLs!D19,1),\"ok\"),\"Palavra-chave não encontrada na URL\"),\"--\")","v":"--"},{"$f":"IF(C19<>\"\",IFERROR(IF(SEARCH($C19,URLs!K19,1),\"ok\"),\"Palavra-chave não encontrada no Título H1\"),\"--\")","v":"--"},{"$f":"IF(C19<>\"\",IFERROR(IF(SEARCH($C19,URLs!L19,1),\"ok\"),\"Palavra-chave não encontrada na imagem\"),\"--\")","v":"--"},{"$f":"IF(C19<>\"\",IF(URLs!H19=\"\",\"Descrição não preeenchida\",\"ok\"),\"--\")","v":"--"}]
[16,{"$f":"IFERROR(IF(VLOOKUP($A20,URLs!B$5:J$104,3,)<>0,VLOOKUP($A20,URLs!B$5:J$104,3,),\"\"),\"\")","v":""},{"$f":"IFERROR(IF(VLOOKUP($A20,URLs!B$5:J$104,9,)<>0,VLOOKUP($A20,URLs!B$5:J$104,9,),\"\"),\"\")","v":""},0,{"$f":"IF(C20<>\"\",IFERROR(IF(SEARCH($C20,URLs!E20,1),\"ok\"),\"Palavra-chave não encontrada no título\"),\"--\")","v":"--"},{"$f":"IF(C20<>\"\",IFERROR(IF(SEARCH(SUBSTITUTE(tiraAcento($C20),\" \",\"-\"),URLs!D20,1),\"ok\"),\"Palavra-chave não encontrada na URL\"),\"--\")","v":"--"},{"$f":"IF(C20<>\"\",IFERROR(IF(SEARCH($C20,URLs!K20,1),\"ok\"),\"Palavra-chave não encontrada no Título H1\"),\"--\")","v":"--"},{"$f":"IF(C20<>\"\",IFERROR(IF(SEARCH($C20,URLs!L20,1),\"ok\"),\"Palavra-chave não encontrada na imagem\"),\"--\")","v":"--"},{"$f":"IF(C20<>\"\",IF(URLs!H20=\"\",\"Descrição não preeenchida\",\"ok\"),\"--\")","v":"--"}]
{"$rows_left_out":85}
{"sheet":"Infos","index":2,"n_rows":21,"n_cols":12,"rows_kept":21,"cut":false,"hidden":false,"merged":[[16,1,16,6],[17,1,17,6],[20,1,20,6],[4,10,4,19],[1,1,1,7],[2,1,2,7],[5,2,5,7],[7,2,7,7],[9,2,9,7],[12,1,14,6],[3,1,3,7]]}
[]
[null,"Planilha de SEO"]
[null,"Criada por Felipe Silva"]
[null,"Consultoria e Treinamento de SEO"]
[null,null,null,null,null,null,null,null,null,null,"Dicas de uso:"]
[null,null,"felipercsilva.net.br",null,null,null,null,null,null,null,"1 - Insira a URL da página na coluna URL;"]
[null,null,null,null,null,null,null,null,null,null,"2 - Copie e otimize o título <title> da página;"]
[null,null,"felipercsilva@gmail.com",null,null,null,null,null,null,null,"3 - Copie e otimize a description da página;"]
[null,null,null,null,null,null,null,null,null,null,"4 - Copie e otimize o título H1 da página;"]
[null,null,"https://www.linkedin.com/in/felipercsilva/pt",null,null,null,null,null,null,null,"5 - Copie e otimize o texto alternativo (alt) da principal imagem;"]
[null,null,null,null,null,null,null,null,null,null,"6 - Na coluna \"palavra-chave\""," coloque a principal palavra-chave daquela página;"]
[null,null,null,null,null,null,null,null,null,null,"7 - Na PLANILHA \"palavras-chave\",  veja o índice de otimização da página e otimizações recomendadas."]
[null,"Envie seu feedback para otimizar nossa planilha de SEO"]
[]
[]
[]
[null,"Download e atualizações em:"]
[null,"https://felipercsilva.net.br/planilha-seo/"]
[]
[]
{"$rows_left_out":1}